program: Gaussian 16
title: TEXT
version: ES64L-G16RevB.01
basis: TZVP
method: RB3LYP
operation: Freq
keyword: #p
keyword: b3lyp
keyword: freq
keyword: scrf=(smd,solvent=1,4-dioxane)
keyword: nosymm
keyword: pop=fullcphf=conver=7
keyword: empiricaldispersion=gd3
keyword: int=(acc2e=11,grid=ultrafine)
keyword: tzvp
title: #p b3lyp freq scrf=(smd,solvent=1,4-dioxane) nosymm pop=full cphf=conv
basis: NPDir=0 NMtPBC= 1 NCelOv= 1 NCel= 1 NClECP= 1 NCelD= 1
basis: NCelK= 1 NCelE2= 1 NClLst= 1 CellRange= 0.0.
basis: One-electron integrals computed using PRISM.
basis: NBasis= 1356 RedAO= T EigKep= 5.87D-06 NBF= 1356
basis: NBsUse= 1356 1.00D-06 EigRej= -1.00D+00 NBFU= 1356
converged: NO NO NO NO
title: Mulliken charges:
elementType: Ni P C H C H C H H C H H C H H C H H C H H C H H C H H C H H C H H C H H C H H P C H C H C H H C H H C H H C H H C H H C H H C H H C H H C H H C H H C H H C C C C H C H C H H H C N K Se O C C C H H C H H C C H H H H C H H O H H H H H
charge: -0.073776 0.370104 -0.208783 0.164385 -0.258301 0.210363 -0.280678 0.122477 0.166243 -0.254301 0.154412 0.131223 -0.277243 0.149725 0.123178 -0.408374 0.174760 0.174432 -0.231597 0.139066 0.123519 -0.228331 0.113810 0.129011 -0.237393 0.133633 0.101174 -0.244868 0.129551 0.118129 -0.242331 0.102568 0.127939 -0.223904 0.129913 0.102670 -0.229464 0.124796 0.110766 0.459731 -0.276967 0.161861 -0.244606 0.198430 -0.287573 0.115269 0.198943 -0.206580 0.102769 0.116225 -0.276490 0.150595 0.119015 -0.435194 0.168336 0.165426 -0.249401 0.144688 0.161517 -0.224854 0.113967 0.122572 -0.239547 0.124525 0.105366 -0.265470 0.120305 0.135654 -0.231625 0.100742 0.127819 -0.220465 0.125307 0.095682 -0.232197 0.125815 0.109987 0.074185 -0.155874 -0.351327 -0.088519 0.156951 -0.092088 0.206585 -0.169685 0.104190 0.112837 0.110978 -0.415783 -0.406987 0.864681 -0.469825 -0.383164 -0.264916 -0.112870 -0.109623 0.168204 0.138132 -0.254134 0.136194 0.122521 -0.068384 -0.099373 0.127034 0.150260 0.136352 0.124579 -0.379176 0.139252 0.102370 -0.281047 0.117569 0.150135 0.109102 0.115518 0.127062
chargesum: -0.00000
title: Mulliken charges with hydrogens summed into heavy atoms:
elementType: Ni P C C C C C C C C C C C C C P C C C C C C C C C C C C C C C C C C C C N K Se O C C C C C C C O
charge: -0.073776 0.370104 -0.044397 -0.047937 0.008042 0.031334 -0.004340 -0.059182 0.030988 0.014490 -0.002586 0.002812 -0.011824 0.008680 0.006097 0.459731 -0.115106 -0.046176 0.026639 0.012414 -0.006880 -0.101431 0.056803 0.011685 -0.009656 -0.009511 -0.003064 0.000525 0.003605 0.074185 0.001077 -0.144742 0.015671 0.020750 -0.058707 -0.415783 -0.406987 0.864681 -0.469825 -0.383164 0.041420 0.145845 0.167671 0.006798 0.173238 0.168331 -0.027493 -0.281047
polarizability: 7.21185272e+02 -1.59576792e+01 6.80823288e+02 -1.00948302e+01 3.46087486e+01 6.72040031e+02
1716.lowfreq: -114.6716 -7.3583 -5.4378 -0.0030 0.0030 0.0054 2.6882 14.4774 16.2465
redmass: 14.0331 5.9794 5.2094 5.7288 4.5690 4.4950 4.5768 4.3773 4.0981 4.7723 4.8197 4.8088 4.0077 4.8253 3.9761 4.1597 3.8123 3.8085 3.5107 8.3515 4.1976 5.1222 4.5313 3.7339 3.3221 3.6352 2.5541 4.0899 5.0299 5.9212 4.8105 5.0330 4.8874 5.6539 3.6542 5.3647 2.7484 3.3011 3.2598 3.4831 6.9179 7.1935 5.9052 3.7408 2.9578 2.8769 3.0542 3.6314 2.7329 3.2064 1.2364 2.5122 2.3457 1.7686 2.9394 2.3742 3.2316 3.0232 2.9307 4.6084 4.5382 1.9715 1.9551 2.7842 2.1611 2.8477 3.7515 3.8902 3.2392 3.1046 2.4107 2.7175 3.0259 3.0436 4.2366 2.6396 2.6822 3.0624 2.7113 2.2920 2.8651 2.6919 3.2470 1.7245 1.6902 1.7555 2.2647 1.6789 6.3851 2.5037 3.7484 5.3813 5.6498 4.5753 2.5238 1.4363 2.5313 2.1479 1.1033 2.7902 1.4817 1.5425 1.8017 1.4870 1.5310 3.3191 3.3067 3.3193 3.2475 4.0604 1.2019 1.9132 1.7439 1.7823 1.7946 1.7553 2.7164 1.8433 1.2682 2.5252 2.1475 2.1545 2.1236 2.1118 2.0846 2.0465 2.0879 2.0329 1.8869 1.3411 1.4370 1.4685 1.5013 1.4445 1.1983 1.5233 3.7985 2.4515 2.4129 2.0662 2.0004 1.9810 1.2981 2.0746 5.6319 2.7086 1.9841 1.9881 2.0111 1.9797 2.0692 1.9011 2.2245 1.8072 1.8887 1.7461 1.8071 2.4656 2.8219 3.0178 3.1216 4.0808 1.0726 1.9358 1.0661 2.4857 1.0795 1.0796 1.0928 4.0968 1.8382 1.9222 2.1172 2.0543 1.9441 1.4449 1.1103 1.2768 1.2909 1.1764 1.3281 1.3361 1.2719 1.3894 1.3656 1.4249 1.3324 1.0681 1.3225 1.3659 4.2955 1.1520 1.2824 1.2785 1.2826 1.2557 1.2395 1.2460 1.2425 1.2239 1.2467 1.2280 1.2248 1.2379 1.2137 1.1262 1.2056 1.2302 1.1907 1.2008 1.1681 1.2059 1.4365 1.3872 1.3192 1.3376 1.3478 1.3602 1.3069 1.2381 1.3111 1.2737 1.2796 1.3873 1.3966 1.3863 1.4373 1.4433 1.4496 1.4074 1.4363 1.4097 1.3986 1.3810 1.3744 1.2750 1.2302 1.2939 1.3688 1.9745 1.0763 1.0972 1.0913 1.0877 1.0811 1.0893 1.0848 1.0932 1.0879 1.0841 1.0898 1.0807 1.0898 1.0747 1.0849 1.0841 1.0891 1.0875 1.0409 1.1075 1.2665 1.1073 1.1212 1.2793 1.1244 1.1108 1.1087 1.0907 1.0923 1.0974 1.0873 4.6020 4.8937 12.8411 1.0702 1.0717 1.0808 1.0763 1.0686 1.0673 1.0707 1.0683 1.0702 1.0694 1.0665 1.0648 1.0655 1.0687 1.0623 1.0614 1.0623 1.0686 1.0352 1.0649 1.0616 1.0635 1.0663 1.0640 1.0830 1.0866 1.0809 1.0850 1.0829 1.0866 1.0848 1.1002 1.0962 1.0942 1.0968 1.0751 1.0822 1.0912 1.0731 1.0764 1.0817 1.0851 1.0988 1.0821 1.0674 1.0676 1.0957 1.1012 1.1015 1.0956 1.0968 1.0980 1.1019 1.1017 1.1020 1.1006 1.0930 1.0988 1.0992 1.0980 1.1021 1.0999 1.0923 1.0865 1.0872 1.0898 1.0901 1.0962
temp: 298.150 k
press: 1.00000 atm
elementType: 28 15 6 1 6 1 6 1 1 6 1 1 6 1 1 6 1 1 6 1 1 6 1 1 6 1 1 6 1 1 6 1 1 6 1 1 6 1 1 15 6 1 6 1 6 1 1 6 1 1 6 1 1 6 1 1 6 1 1 6 1 1 6 1 1 6 1 1 6 1 1 6 1 1 6 1 1 6 6 6 6 1 6 1 6 1 1 1 6 7 19 34 8 6 6 6 1 1 6 1 1 6 6 1 1 1 1 6 1 1 8 1 1 1 1 1
symmnumber: 1
zpe: 2685086.5 jmol-1
zpe.correction: 1.022695 hartree
zpe.thermalcorrener: 1.077886 hartree
zpe.thermalcorrenthalpy: 1.078830 hartree
zpe.thermalcorrgfe: 0.929540 hartree
zpe.sumelectzpe: -6962.970661 hartree
zpe.sumelectthermal: -6962.915471 hartree
zpe.sumelectthermalent: -6962.914526 hartree
zpe.sumelectthermalfe: -6963.063817 hartree
dipole: -0.1579 0.2511 3.9688
dipole: 3.9799
quadrupole: -342.2792 -293.3587 -347.3139
quadrupole: -12.7020 33.1416 14.2188
quadrupole: -14.6286 34.2919 -19.6632 -12.7020 33.1416 14.2188
hfenergy: -6963.9933566 hartree
pointgroup: C01 [X(C40H68K1N1Ni1O2P2Se1)]
dipole: -0.0621362 0.0987791 1.5614421 debye
polarizability: 721.1852721|-15.9576792|680.8232878|-10.0948302|34.6087486|672.0400313 unknown
InChI: InChI=1/40C.K.N.Ni.2O.2P.Se.68H
charge 0 multiplicity 1
116 atoms
Ni 8.820116 6.053544 2.074916
P  7.805979 4.202534 2.81094
C  5.994786 3.817672 2.492696
H  5.902007 2.736366 2.653635
C  7.995277 4.027162 4.666282
H  7.344122 4.816866 5.049384
C  9.42491 4.351933 5.124768
H  10.106849 3.573248 4.769503
H  9.76075 5.287365 4.673447
C  5.650016 4.11763 1.02321
H  5.843513 5.171646 0.816463
H  6.304184 3.55512 0.353814
C  7.534744 2.693291 5.271273
H  6.518956 2.445045 4.95744
H  8.182002 1.884038 4.917373
C  8.623765 2.677053 2.101786
H  8.460197 1.82258 2.76067
H  8.098135 2.465325 1.171464
C  5.021749 4.527541 3.449565
H  5.227423 4.250994 4.484953
H  5.159389 5.606323 3.379757
C  7.606361 2.747974 6.804161
H  6.889286 3.493176 7.167218
H  7.299674 1.785835 7.224683
C  4.187874 3.78916 0.705121
H  3.972826 4.058925 -0.332605
H  4.029551 2.706833 0.789406
C  9.504192 4.418726 6.652743
H  10.530951 4.630928 6.964558
H  8.888198 5.253692 7.006135
C  3.565065 4.185708 3.113834
H  3.38938 3.117705 3.293357
H  2.900107 4.731651 3.789397
C  9.011396 3.116227 7.291859
H  9.023271 3.19895 8.382317
H  9.703748 2.306622 7.031168
C  3.231875 4.512084 1.656305
H  2.195309 4.242885 1.432895
H  3.320176 5.593387 1.501442
P  10.420442 4.618363 1.134561
C  12.250961 4.82414 1.51679
H  12.702993 3.857285 1.263069
C  10.3727 4.327849 -0.724896
H  10.447675 5.339076 -1.136893
C  9.018751 3.74625 -1.167036
H  8.927651 2.721068 -0.790925
H  8.207287 4.337568 -0.748694
C  12.485419 5.077517 3.015561
H  12.007036 6.020207 3.287603
H  12.018861 4.298951 3.621871
C  11.504457 3.461115 -1.305439
H  12.488807 3.828251 -1.01744
H  11.422675 2.441253 -0.912573
C  10.110613 2.904432 1.835322
H  10.510056 2.145772 1.159485
H  10.678459 2.832717 2.762988
C  12.944341 5.918494 0.68569
H  12.795215 5.758282 -0.382878
H  12.48775 6.879891 0.924678
C  11.41527 3.414214 -2.838357
H  11.586219 4.423002 -3.231148
H  12.216274 2.782605 -3.23478
C  13.982165 5.14843 3.340659
H  14.117609 5.363028 4.405104
H  14.438605 4.167922 3.15742
C  8.910362 3.716554 -2.694276
H  7.94336 3.297062 -2.987565
H  8.931406 4.745673 -3.067472
C  14.444388 5.970349 0.998051
H  14.916061 5.027402 0.693547
H  14.915311 6.761604 0.407476
C  10.051855 2.909719 -3.318545
H  9.997608 2.949223 -4.410516
H  9.94195 1.855018 -3.036888
C  14.695428 6.202932 2.490506
H  15.768561 6.199803 2.703505
H  14.320755 7.195748 2.763152
C  7.450131 7.085653 3.009729
C  7.464379 7.349193 4.389328
C  6.347426 7.600953 2.30253
C  6.454383 8.070814 5.024783
H  8.28443 6.983648 4.993963
C  5.338381 8.336953 2.923624
H  6.265718 7.394522 1.24262
C  5.381352 8.574523 4.295602
H  6.511415 8.247128 6.093965
H  4.501034 8.700386 2.33544
H  4.596359 9.137009 4.786991
C  7.950194 6.749005 -0.477673
N  7.718697 7.62238 -1.220113
K  7.871898 9.839102 0.442083
Se 10.162916 7.971517 1.991347
O  8.031781 12.028578 2.113372
C  10.555446 8.384761 3.90118
C  6.956895 12.891331 2.514823
C  8.950241 11.819055 3.20435
H  9.69414 8.890693 4.333556
H  10.665675 7.434531 4.425424
C  11.81791 9.221311 4.06594
H  6.278671 12.975571 1.663466
H  7.356855 13.886717 2.74511
C  6.24082 12.320503 3.725603
C  8.217706 11.259213 4.408007
H  9.433982 12.771109 3.454136
H  9.704743 11.115665 2.851279
H  12.667397 8.685095 3.634437
H  11.725506 10.149934 3.493838
C  12.104049 9.547933 5.533211
H  5.471297 13.011889 4.073249
H  5.766244 11.365528 3.463096
O  7.152039 12.128159 4.805896
H  7.819294 10.265261 4.17573
H  8.89292 11.175223 5.26014
H  11.282386 10.113165 5.982892
H  12.23453 8.634891 6.121132
H  13.014295 10.14429 5.638989
