program: Gaussian 09
title: 000053040
version: EM64L-G09RevD.01
frameworkgroup: C1[X(C23H25N3O4)]
method: RPBEPBE
basis: SDD
operation: Freq
keyword: #p
keyword: freq=noraman
keyword: PBEPBE/SDD
title: #p freq=noraman PBEPBE/SDD
converged: YES YES NO NO
title: Mulliken charges:
elementType: O O O O N N N C C C C C C C C C C C C C C C C C C C C C C C H H H H H H H H H H H H H H H H H H H H H H H H H
charge: -0.268955 -0.287815 -0.392306 -0.270276 -0.164702 -0.277989 -0.346999 0.081484 0.363963 -0.186949 0.090277 -0.541346 -0.726422 -0.713393 0.434144 -0.694787 -0.362390 -0.380880 0.071068 0.144850 -0.216237 -0.216280 0.339360 -0.252830 -0.349546 -0.687263 -0.368469 -0.237085 -0.229883 0.257048 0.186655 0.239754 0.273246 0.226030 0.256157 0.209311 0.261678 0.210944 0.208847 0.264452 0.232864 0.305965 0.369620 0.286915 0.253871 0.227761 0.226742 0.229235 0.269021 0.284073 0.264083 0.245991 0.236831 0.234048 0.386511
chargesum: 0.00000
title: Mulliken charges with hydrogens summed into heavy atoms:
elementType: O O O O N N N C C C C C C C C C C C C C C C C C C C C C C C
charge: -0.268955 -0.287815 -0.005794 -0.270276 -0.164702 -0.277989 0.022621 0.081484 0.363963 -0.000293 0.090277 -0.028346 -0.034923 -0.031923 0.434144 0.108494 -0.075475 -0.127009 0.071068 0.144850 0.011525 0.010462 0.339360 -0.023595 -0.080524 -0.139107 -0.122478 -0.000254 0.004165 0.257048
polarizability: 3.33337111e+02 -1.85593446e+01 2.91971283e+02 -2.65257452e+01 -9.65085220e+00 2.37303151e+02
1716.lowfreq: -1.9600 -0.0004 0.0005 0.0006 2.9981 8.0670 11.6480 17.7847 27.0048
frequency: 11.3979 17.7821 26.9421 44.4319 49.2523 54.3466 59.6860 71.1173 89.2084 97.9687 102.2739 110.4045 113.3988 142.7231 151.4233 164.0763 194.1512 206.8548 221.5872 224.5697 226.0640 248.1050 254.8094 268.5835 276.0162 290.5943 306.0675 318.7136 346.8193 369.0282 385.2371 408.1095 411.8127 425.8795 437.8956 449.2631 466.1002 481.3628 499.8614 503.5337 546.7866 559.7223 563.6141 605.8438 615.7512 617.2052 641.3445 652.4086 660.9297 684.4976 697.6068 699.1294 708.1222 750.2891 755.0971 758.6125 784.5997 788.2028 804.2595 833.4881 839.4562 841.3709 856.9601 867.2477 898.5424 904.7943 912.4603 924.6668 931.3599 957.6385 966.8018 969.5143 985.3560 985.6997 989.1675 996.7056 997.8610 1024.6558 1034.9619 1046.5956 1053.2076 1066.5819 1073.9787 1091.6969 1099.4080 1114.3919 1132.6422 1149.7738 1156.6998 1171.9451 1172.1757 1175.7103 1184.6873 1186.4842 1188.6912 1200.8701 1245.3246 1276.6112 1289.4888 1292.3106 1294.9602 1302.4568 1316.3512 1328.5772 1335.5838 1344.1628 1348.8905 1373.7752 1377.3168 1378.6232 1386.4966 1394.3980 1433.0490 1442.0636 1448.5152 1455.4869 1458.5148 1463.8838 1477.7077 1478.1235 1479.2624 1483.9630 1489.5012 1496.1677 1498.7525 1534.1945 1570.5070 1587.7831 1588.5718 1604.0342 1609.2152 1614.6554 1620.0193 1628.7166 2968.4655 2971.5714 2977.0745 2981.2375 3019.8963 3022.6702 3070.1301 3074.6168 3074.8258 3081.6431 3088.6421 3095.0364 3100.8689 3115.1785 3124.0354 3127.5153 3138.3534 3139.8745 3151.7188 3154.7354 3165.3742 3170.0579 3192.7095 3318.3774 3501.7989
redmass: 6.6979 5.8406 5.6861 5.2197 4.0830 4.0751 3.5978 5.0689 6.2211 5.5825 4.7771 5.9301 5.8133 4.3030 4.1233 3.6310 3.8533 4.2666 1.6069 1.3786 1.7059 1.5254 2.1299 4.5195 4.3375 4.0972 4.5342 4.0437 3.0321 4.4777 3.9492 3.1059 2.9420 2.4358 3.2690 4.4722 4.0826 4.2660 3.2787 3.4617 4.1415 4.0551 3.9895 4.9321 5.7915 7.1866 2.8109 3.0950 3.0135 6.1221 2.1635 2.9972 4.5099 3.0842 3.8922 1.6947 3.1468 2.0520 3.4477 1.3082 3.3932 1.2651 3.6681 3.3415 1.8229 2.2424 1.5636 1.2008 1.9324 1.4853 1.4297 1.3683 4.7855 4.0361 1.4244 3.1528 1.3479 2.4080 2.2520 2.3928 2.6554 2.1690 2.2047 1.7972 2.4382 2.4531 1.5194 2.1544 2.2850 1.8807 1.1276 1.1143 1.1841 1.2596 2.5142 2.3058 1.3901 1.7343 1.4957 1.7293 1.4003 2.2871 1.9289 2.0320 1.6457 2.0858 1.5556 1.1941 6.6797 3.7325 4.2956 1.5060 2.2695 1.7988 1.3875 1.1196 1.1039 1.0423 1.9675 1.1690 1.0611 2.1547 1.1395 1.0643 1.0535 2.0668 3.5141 6.4273 5.5011 7.0636 6.3658 8.9268 8.0386 7.8233 1.0395 1.0768 1.0352 1.0403 1.0627 1.0597 1.1004 1.0995 1.0983 1.1018 1.1010 1.1000 1.0997 1.1006 1.0876 1.0850 1.0890 1.0890 1.0941 1.0941 1.0996 1.1004 1.0957 1.0851 1.0639
irintensity: 0.8937 0.2179 1.5031 1.6241 0.4962 1.6805 0.3182 1.2640 2.4480 2.1982 3.9095 1.6287 2.1195 1.2304 9.3762 5.9980 1.7484 3.7977 3.4459 0.3654 1.3260 1.9990 2.4500 1.8996 5.8310 0.7774 8.1494 3.2843 3.3797 1.8879 5.0962 4.3737 2.1276 4.4603 12.2409 8.4935 0.9806 7.4759 15.9874 21.3000 5.4425 18.6517 41.8560 5.9542 2.3093 14.7178 52.5158 7.6157 49.0362 10.8069 38.3178 57.7578 23.0153 27.4864 14.4642 78.0064 9.0797 24.4348 20.0135 116.2938 10.2859 1.7848 12.2458 0.7298 0.6057 0.8514 4.9010 7.8766 15.7104 0.0269 1.1451 0.9773 8.5787 1.0647 0.9426 10.9019 0.6090 7.1260 3.5013 32.2238 64.8151 126.5974 21.9270 30.1853 120.5008 2.6072 68.1626 1.8486 18.3441 1.4514 0.0819 4.6626 10.8928 1.0669 13.6907 0.3091 39.0723 22.7026 16.8518 7.3636 3.4436 91.8792 73.7511 59.7804 19.3629 45.7450 28.7208 17.9651 3.2354 38.6661 21.1975 13.9659 4.9029 9.6771 17.3974 34.5708 20.0828 3.6884 2.3992 26.9382 2.9146 124.9976 7.2577 14.6414 37.8298 213.7474 71.7456 9.1267 60.3450 147.2098 43.7175 28.0770 176.3333 208.4740 70.9901 32.7626 34.0992 48.1973 3.2188 24.3832 18.5313 72.7366 7.6373 9.3203 6.3966 29.0857 1.7839 8.9606 3.0185 2.2727 9.7174 7.6774 32.9334 13.0256 21.5132 23.8032 1.7746 284.3027 34.3215
temp: 298.150 k
press: 1.00000 atm
elementType: 8 8 8 8 7 7 7 6 6 6 6 6 6 6 6 6 6 6 6 6 6 6 6 6 6 6 6 6 6 6 1 1 1 1 1 1 1 1 1 1 1 1 1 1 1 1 1 1 1 1 1 1 1 1 1
symmnumber: 1
zpe: 1154277.6 jmol-1
zpe.correction: 0.439641 hartree
zpe.thermalcorrener: 0.468064 hartree
zpe.thermalcorrenthalpy: 0.469008 hartree
zpe.thermalcorrgfe: 0.378286 hartree
zpe.sumelectzpe: -1354.441271 hartree
zpe.sumelectthermal: -1354.412849 hartree
zpe.sumelectthermalent: -1354.411905 hartree
zpe.sumelectthermalfe: -1354.502626 hartree
dipole: 4.2747 -0.7504 1.5123
dipole: 4.5960
quadrupole: -173.4180 -168.6664 -172.1918
quadrupole: 5.5123 14.5994 -4.7938
quadrupole: -1.9926 2.7590 -0.7664 5.5123 14.5994 -4.7938
hfenergy: -1354.8809126 hartree
pointgroup: C01 [X(C23H25N3O4)]
dipole: 1.6148081 -0.5741766 0.5764892 debye
polarizability: 329.6545239|-19.7149936|297.9251495|-27.4459552|0.569453|235.0318716 unknown
InChI: InChI=1S/C23H25N3O4/c1-15(2)21-19(25(3)26(23(21)30)17-10-5-4-6-11-17)14-24-22(29)18-12-8-7-9-16(18)13-20(27)28/h4-12,15,24,27H,13-14H2,1-3H3
charge 0 multiplicity 1
55 atoms
O  -3.707128 1.716363 0.828321
O  2.134576 -0.26584 -2.767274
O  2.00508 -0.079603 3.620028
O  2.109279 1.467655 1.904425
N  -1.215131 0.217361 -1.242275
N  -2.489609 0.20633 -0.585342
N  1.772637 1.148436 -0.951396
C  -1.51454 2.26943 -0.218744
C  -0.679864 1.512262 -1.024182
C  -1.291592 3.652578 0.357096
C  -2.704942 1.460632 0.091564
C  0.667592 1.877163 -1.605079
C  -1.14711 3.587656 1.903577
C  -2.437568 4.617227 -0.052703
C  -3.150817 -1.027319 -0.310553
C  -1.185231 -0.383497 -2.605795
C  -4.549853 -1.021542 -0.070647
C  -2.423939 -2.24641 -0.253685
C  2.397009 0.083803 -1.565883
C  3.456356 -0.639022 -0.762574
C  -5.208315 -2.234926 0.218396
C  -3.101411 -3.453492 0.019153
C  3.277807 -1.111052 0.570885
C  -4.495509 -3.456383 0.256233
C  4.670118 -0.918879 -1.444391
C  1.973213 -0.943247 1.360369
C  4.340237 -1.813517 1.19639
C  5.721167 -1.605882 -0.806769
C  5.557532 -2.05097 0.525738
C  2.031975 0.268076 2.277933
H  -0.342556 4.054141 -0.053563
H  0.825211 2.960524 -1.47328
H  0.728141 1.651332 -2.684402
H  -0.2815 2.964242 2.193578
H  -2.061125 3.159833 2.35136
H  -0.99725 4.602014 2.317921
H  -3.400568 4.251359 0.343059
H  -2.521928 4.696129 -1.152109
H  -2.251586 5.628325 0.354463
H  -1.587272 -1.406605 -2.562514
H  -1.790495 0.210937 -3.318157
H  -0.13621 -0.433135 -2.941406
H  2.019653 1.416472 0.016596
H  -5.093734 -0.074986 -0.091013
H  -1.338195 -2.238898 -0.396682
H  -6.287198 -2.224136 0.408596
H  -2.535111 -4.390839 0.057948
H  -5.017197 -4.394945 0.471861
H  4.763804 -0.593755 -2.485395
H  1.113744 -0.801181 0.680306
H  1.78528 -1.836564 1.975401
H  4.200552 -2.187121 2.21803
H  6.655062 -1.800845 -1.344393
H  6.364006 -2.593151 1.031182
H  2.047454 0.738366 4.188095
