program: Gaussian 16
title: Title Card Required
version: ES64L-G16RevB.01
method: UB3LYP
basis: TZVP
operation: Freq
keyword: #PGeom=AllCheck
keyword: Guess=TCheck
keyword: SCRF=Check
keyword: GenChk
keyword: UB3LYP/TZVP
keyword: Freq
converged: YES YES YES YES
polarizability: 7.72963949e+01 3.73874435e+00 5.22672693e+01 -2.17469941e-04 -8.76277764e-05 4.84725253e+01
1716.lowfreq: -51.0457 -0.0049 0.0025 0.0034 9.9244 10.1845 115.8419 243.5355 244.0991
frequency: 115.8240 243.5287 244.0954 370.2244 524.7657 717.5436 791.6073 909.4264 990.4799 1036.6234 1113.6785 1238.7994 1267.5615 1324.1145 1370.7873 1419.7427 1431.1143 1490.0346 1498.4338 1504.9849 3004.3099 3013.8920 3023.1207 3037.4120 3066.2003 3090.0467 3093.0973
redmass: 2.6583 1.0777 3.2591 4.5395 1.2609 4.4454 1.1133 2.0358 1.0896 2.9440 1.9712 1.4298 1.2497 1.1005 1.3622 1.2280 1.1048 1.0525 1.0386 1.0787 1.0584 1.0927 1.0362 1.0599 1.1036 1.1042 1.1008
irintensity: 1.6991 0.1008 1.7268 0.1362 7.6599 1.6625 2.3454 8.8718 0.6960 0.3161 1.8397 0.0499 12.4389 0.3909 0.4221 1.6815 16.8226 1.9784 9.5894 8.6249 7.0952 0.7562 30.1761 23.9223 0.0786 72.1915 42.2178
temp: 298.150 k
press: 1.00000 atm
elementType: 16 6 1 1 6 1 1 6 1 1 1
symmnumber: 1
zpe: 244824.4 jmol-1
zpe.correction: 0.093249 hartree
zpe.thermalcorrener: 0.098729 hartree
zpe.thermalcorrenthalpy: 0.099673 hartree
zpe.thermalcorrgfe: 0.064080 hartree
zpe.sumelectzpe: -516.673403 hartree
zpe.sumelectthermal: -516.667922 hartree
zpe.sumelectthermalent: -516.666978 hartree
zpe.sumelectthermalfe: -516.702571 hartree
dipole: 2.0827 0.5941 -0.0000
dipole: 2.1658
quadrupole: -37.9182 -34.7139 -32.2321
quadrupole: -0.0213 0.0000 0.0001
quadrupole: -2.9634 0.2408 2.7226 -0.0213 0.0000 0.0001
hfenergy: -516.7666513 hartree
pointgroup: C01 [X(C3H7S1)]
dipole: 0.8194095 0.2337357 -0.0000072 debye
dipolederiv: -0.1846207 0.1173627 0.0000013 0.0555602 -0.1268634 -0.0000032 0.000004 -0.0000058 -0.1527869 0.3370151 -0.06483 -0.0000075 -0.1335184 0.0211313 0.0000068 -0.0000203 0.0000093 0.0495314 -0.0411272 -0.0408731 0.0323633 0.0439694 0.0250229 0.0777804 0.0095537 0.0999573 0.0103178 -0.0411295 -0.0408691 -0.0323577 0.0439686 0.0250237 -0.0777823 -0.0095431 -0.0999596 0.0103224 0.0271436 0.0365683 0.0000003 -0.0944154 0.0892026 0. 0.0000075 -0.0000006 0.1992546 0.0042584 -0.0342104 -0.0404982 0.0019253 -0.025175 -0.0900683 -0.0233589 -0.1159534 -0.0752605 0.0042595 -0.0342083 0.0404985 0.0019255 -0.0251719 0.090067 0.0233577 0.1159527 -0.0752633 -0.0540623 -0.0032336 0.000001 0.0808084 0.1005989 0.0000002 -0.0000002 0.0000007 0.1368647 -0.1282516 0.0916553 0.0000002 0.1190712 -0.0511491 0.0000002 0. 0.0000005 0.0838583 0.0382579 -0.0136805 -0.0041505 -0.0596466 -0.0163084 0.1117194 0.0407287 0.1223205 -0.093421 0.0382569 -0.0136815 0.0041492 -0.0596482 -0.0163117 -0.1117202 -0.040729 -0.1223216 -0.0934176 unknown
polarizability: 77.2963949|3.7387444|52.2672693|-0.0002175|-0.0000876|48.4725253 unknown
InChI: InChI=1/3C.S.7H
charge 0 multiplicity 2
11 atoms
S  -1.86427783 -0.03787089 0.0000237
C  -0.14145455 0.5538187 0.00000407
H  -0.04409448 1.21247857 -0.87143156
H  -0.04408534 1.21248984 0.87143071
C  0.93429137 -0.52773305 0.00000644
H  0.7999471 -1.16716473 -0.87648242
H  0.79995538 -1.16715241 0.8765055
C  2.34050529 0.07197632 -0.0000047
H  3.10096543 -0.71218254 -0.00000305
H  2.50691509 0.69552992 -0.88296908
H  2.50692392 0.69554228 0.88294931
