program: Gaussian 16
title: Title Card Required
version: ES64L-G16RevB.01
method: RB3LYP
basis: TZVP
operation: Freq
keyword: #P
keyword: Geom=AllCheck
keyword: Guess=TCheck
keyword: SCRF=Check
keyword: GenChk
keyword: RB3LYP/TZVP
keyword: Freq
converged: YES YES YES YES
title: Mulliken charges:
elementType: S S C H H C H H C H H H C H H C H H C H H H
charge: -0.057606 -0.057606 -0.276805 0.152660 0.145674 -0.209449 0.121997 0.125186 -0.371369 0.118614 0.134867 0.116231 -0.276805 0.152660 0.145674 -0.209449 0.121997 0.125186 -0.371369 0.118614 0.134867 0.116231
chargesum: -0.00000
title: Mulliken charges with hydrogens summed into heavy atoms:
elementType: S S C C C C C C
charge: -0.057606 -0.057606 0.021528 0.037735 -0.001657 0.021528 0.037735 -0.001657
polarizability: 1.71819577e+02 5.73847373e+00 1.05115313e+02 3.40499191e-04 -3.19510332e-04 1.15517430e+02
1716.lowfreq: -12.1647 -5.3515 -0.0029 -0.0024 -0.0020 5.9117 33.6775 53.1188 58.7010
frequency: 33.6584 53.1028 58.6650 104.3968 110.8170 136.6159 150.2949 238.9570 251.9384 252.5514 318.8103 343.7574 348.8877 509.9927 729.7470 732.5398 767.3219 767.9709 882.7286 886.1014 911.6741 912.2393 1039.5213 1039.7414 1071.0838 1075.6848 1112.4331 1112.4370 1247.2660 1249.4803 1275.0383 1277.4688 1333.5982 1335.4781 1381.1218 1382.5931 1420.6988 1420.8981 1484.5461 1485.5597 1494.3967 1494.4308 1500.1703 1500.2094 1508.3741 1508.3830 3026.1668 3026.3062 3028.5949 3028.6342 3054.3440 3055.3919 3057.0359 3057.3901 3089.6439 3089.6831 3093.7259 3093.7586 3111.7481 3112.1428
redmass: 3.9429 1.6795 1.5110 2.5874 3.4559 5.0392 4.1864 3.4871 1.1033 1.1547 4.9931 3.4847 3.9251 26.8414 4.8645 4.7746 1.0837 1.0881 1.1965 1.2007 2.0747 2.0527 3.0256 3.0255 1.1732 1.1850 1.9359 1.9170 1.3860 1.3772 1.2321 1.2292 1.0951 1.0965 1.3855 1.3810 1.2219 1.2226 1.0894 1.0889 1.0496 1.0492 1.0387 1.0386 1.0856 1.0858 1.0355 1.0354 1.0586 1.0589 1.0608 1.0708 1.0988 1.0886 1.1038 1.1038 1.1016 1.1016 1.1097 1.1098
irintensity: 0.2821 0.1066 0.0861 0.9671 0.0541 0.7935 1.6334 1.6931 0.0139 0.0439 1.2243 0.0921 0.7830 0.3221 3.9705 0.9438 4.9653 4.4121 0.1527 0.0209 0.5644 4.0262 0.4474 0.4990 0.8933 0.8419 31.5237 0.0022 0.0271 0.2785 21.5801 11.1126 0.7718 0.6772 3.9321 0.6052 2.7262 3.2334 0.0468 16.5022 0.9022 1.8869 11.7364 9.1367 12.4166 2.4175 36.6911 30.3475 29.0847 9.4909 28.5831 11.0882 0.3172 18.6630 38.1925 37.5967 89.5653 0.4874 41.4252 30.1400
temp: 298.150 k
press: 1.00000 atm
elementType: 16 16 6 1 1 6 1 1 6 1 1 1 6 1 1 6 1 1 6 1 1 1
symmnumber: 1
zpe: 503495.9 jmol-1
zpe.correction: 0.191771 hartree
zpe.thermalcorrener: 0.203586 hartree
zpe.thermalcorrenthalpy: 0.204530 hartree
zpe.thermalcorrgfe: 0.152057 hartree
zpe.sumelectzpe: -1033.429770 hartree
zpe.sumelectthermal: -1033.417956 hartree
zpe.sumelectthermalent: -1033.417012 hartree
zpe.sumelectthermalfe: -1033.469485 hartree
dipole: -0.0000 -0.0001 2.7080
dipole: 2.7080
quadrupole: -58.3080 -68.8932 -74.3901
quadrupole: -0.8235 0.0000 0.0002
quadrupole: 8.8891 -1.6961 -7.1930 -0.8235 0.0000 0.0002
hfenergy: -1033.6215419 hartree
pointgroup: C01 [X(C6H14S2)]
dipole: -0.0000036 -0.000032 1.0654016 debye
dipolederiv: -0.090597 0.0718663 -0.1275218 0.0125526 -0.0988196 0.0403419 0.0074436 0.1166369 -0.1230038 -0.0905962 0.071857 0.1275269 0.0125535 -0.0988128 -0.0403411 -0.0074441 -0.1166351 -0.1230124 0.1226446 -0.1253047 0.1178183 -0.2508337 0.0736943 -0.010933 0.1934323 -0.0105647 0.2051882 0.0025293 0.0370595 -0.0435131 0.0604878 -0.1123563 0.0073231 -0.0720925 -0.0084202 0.0121453 -0.0407102 0.0059202 0.0304873 0.04387 0.047334 0.0282296 0.010446 0.0347777 -0.126227 0.1168397 -0.0166352 -0.0208281 0.2126786 0.1439272 0.0940467 -0.2180112 0.0103813 0.0716278 0.0277321 0.0698741 -0.0082732 0.0102415 -0.1532909 -0.0267557 -0.0022032 -0.0253999 0.0425794 -0.0019429 -0.004982 0.0420078 -0.0077218 0.0554694 -0.0083017 0.0962329 0.0223411 -0.1334572 -0.0188238 0.0068493 -0.0796177 -0.1032934 0.1157302 -0.0145178 -0.0009878 0.0276327 0.1118944 0.0616412 0.021166 -0.013206 0.0778581 -0.1559124 -0.0165889 -0.0078084 -0.0671515 0.0310048 -0.1849662 -0.0790565 -0.0722265 -0.0893292 0.0221125 0.0039911 -0.0749321 0.0127254 0.0419902 0.0056524 0.0132442 0.1225058 0.0334895 0.0621057 0.000096 0.0497368 0.012226 -0.1337366 0.1226485 -0.1252981 -0.1178257 -0.250826 0.0736968 0.0109244 -0.193445 0.0105536 0.2051852 0.0025284 0.0370578 0.0435155 0.0604842 -0.1123552 -0.0073298 0.0720953 0.0084145 0.0121457 -0.0407101 0.0059211 -0.0304873 0.0438705 0.0473375 -0.0282197 -0.010443 -0.0347677 -0.126228 0.1168384 -0.016635 0.0208282 0.2126645 0.143933 -0.0940409 0.2180251 -0.0103764 0.0716238 0.0277319 0.0698756 0.0082768 0.0102426 -0.1532931 0.0267447 0.0022035 0.0253888 0.0425823 -0.0019428 -0.00498 -0.0420077 -0.0077164 0.0554708 0.0083124 -0.0962323 -0.0223307 -0.1334582 -0.0188248 0.0068445 0.0796161 -0.1032894 0.115726 0.0145184 0.0009778 -0.0276307 0.1118938 0.0616405 0.0211662 0.0132074 0.0778586 -0.1559163 0.0165782 0.0078131 0.0671403 0.0310098 -0.1849655 -0.0790613 0.072221 -0.0893344 0.0221126 -0.0039922 0.0749269 -0.0127265 0.0419901 0.0056525 0.013251 -0.1225039 0.0334923 0.0621069 -0.0000858 -0.0497339 -0.0122149 -0.1337377 unknown
polarizability: 171.8195771|5.7384737|105.1153128|0.0003405|-0.0003195|115.5174297 unknown
InChI: InChI=1/6C.2S.14H
charge 0 multiplicity 1
22 atoms
S  -0.87723277 -0.56876311 -1.75525518
S  0.8772435 0.56887358 -1.75521535
C  1.89069509 -0.24608756 -0.43101816
H  2.02317182 -1.29285602 -0.70646352
H  1.33178338 -0.1995613 0.50467034
C  3.23604851 0.46028703 -0.29341378
H  3.07537872 1.51487611 -0.05074165
H  3.76502929 0.43266242 -1.25057859
C  4.09954522 -0.18976027 0.78882751
H  4.30117215 -1.23890587 0.55739241
H  5.06039399 0.32180657 0.88025823
H  3.60762145 -0.1512176 1.76439536
C  -1.89069494 0.24611929 -0.43101759
H  -2.0231764 1.29290238 -0.7064051
H  -1.33178734 0.19954392 0.50467093
C  -3.23604491 -0.46027081 -0.2934587
H  -3.07536995 -1.51487296 -0.05084676
H  -3.76502246 -0.43259409 -1.25062379
C  -4.09954916 0.18970877 0.78881725
H  -4.30118056 1.23886688 0.55744271
H  -5.06039565 -0.32186836 0.8802143
H  -3.60762893 0.15111149 1.76438472
