program: Gaussian 16
title: Title Card Required
version: ES64L-G16RevB.01
method: RB3LYP
basis: Gen
operation: Freq
keyword: #P
keyword: Geom=AllCheck
keyword: Guess=TCheck
keyword: SCRF=Check
keyword: GenChk
keyword: RB3LYP/ChkBas
keyword: Freq
converged: YES YES YES YES
title: Mulliken charges:
elementType: C H H C H H C H H H C H H C H H C H H H Te Te
charge: -0.522926 0.190819 0.183975 -0.149326 0.124544 0.127380 -0.375251 0.117648 0.132475 0.116036 -0.522929 0.190821 0.183975 -0.149328 0.124542 0.127385 -0.375253 0.117647 0.132475 0.116037 0.054626 0.054626
chargesum: -0.00000
title: Mulliken charges with hydrogens summed into heavy atoms:
elementType: C C C C C C Te Te
charge: -0.148132 0.102598 -0.009092 -0.148133 0.102600 -0.009093 0.054626 0.054626
polarizability: 2.41082880e+02 2.77315194e+01 1.49404584e+02 4.18859431e-03 -1.85707959e-03 1.55358639e+02
1716.lowfreq: -10.8918 -6.0809 -0.0002 -0.0002 0.0003 20.8138 23.6033 46.7226 54.6198
frequency: 20.7737 46.6002 54.6186 57.8519 66.4649 102.5707 113.7545 166.7569 214.7938 220.3242 254.2754 254.3152 281.1986 281.7770 602.5872 604.3129 744.9097 745.5815 845.6156 847.3359 907.4112 907.5074 1029.5869 1031.5761 1033.4936 1034.5490 1101.3563 1101.4519 1215.5159 1219.3161 1241.8391 1244.0124 1335.0039 1336.0798 1370.1886 1371.0812 1418.4643 1418.6093 1473.9758 1475.3093 1493.1250 1493.1284 1498.1448 1498.1677 1506.7333 1506.8289 3024.0568 3024.1631 3024.4922 3024.5260 3052.4293 3052.4304 3077.2136 3078.3277 3089.7600 3089.8719 3090.4949 3090.5134 3138.3726 3138.9202
redmass: 4.1187 1.6572 1.6880 4.8020 6.2173 2.4885 2.7159 10.4824 4.2559 5.7286 1.0886 1.0885 3.3541 3.3715 3.6543 3.6509 1.0950 1.0960 1.1841 1.1864 2.1028 2.1154 1.1071 1.2923 2.9508 2.1558 1.8463 1.8338 1.2621 1.2627 1.4419 1.4333 1.0975 1.0985 1.3539 1.3529 1.2186 1.2189 1.1021 1.1026 1.0479 1.0478 1.0386 1.0386 1.0843 1.0846 1.0347 1.0354 1.0592 1.0586 1.1036 1.1036 1.0570 1.0573 1.1016 1.1013 1.1029 1.1029 1.1102 1.1101
irintensity: 0.1559 0.0562 0.1167 0.0353 0.1400 0.3043 0.2819 0.2490 0.7418 0.1714 0.0445 0.0462 1.4358 0.4465 8.2876 1.5238 8.5410 8.1999 0.0775 0.1540 3.1688 1.3958 3.1290 2.8796 0.5845 0.0596 38.0434 0.0731 74.7256 48.1962 0.9447 1.0606 0.3084 0.4419 4.2089 0.4221 4.0819 2.3060 0.0156 12.1694 1.7369 3.9203 11.6115 9.8560 9.7806 2.3478 45.2578 42.3764 38.6542 0.4148 6.6364 7.1750 15.6806 14.4383 80.5538 19.5942 28.6700 69.1417 16.2954 12.3037
temp: 298.150 k
press: 1.00000 atm
elementType: 6 1 1 6 1 1 6 1 1 1 6 1 1 6 1 1 6 1 1 1 52 52
symmnumber: 1
zpe: 495161.0 jmol-1
zpe.correction: 0.188597 hartree
zpe.thermalcorrener: 0.201657 hartree
zpe.thermalcorrenthalpy: 0.202601 hartree
zpe.thermalcorrgfe: 0.144052 hartree
zpe.sumelectzpe: -253.163054 hartree
zpe.sumelectthermal: -253.149994 hartree
zpe.sumelectthermalent: -253.149050 hartree
zpe.sumelectthermalfe: -253.207599 hartree
dipole: -0.0000 -0.0004 2.3906
dipole: 2.3906
quadrupole: -71.5314 -82.7601 -88.3993
quadrupole: 0.2161 -0.0001 0.0010
quadrupole: 9.3655 -1.8631 -7.5024 0.2161 -0.0001 0.0010
hfenergy: -253.3516509 hartree
pointgroup: C01 [X(C6H14Te2)]
dipole: -0.0000038 -0.0001713 0.9405188 debye
dipolederiv: 0.0992284 -0.1675722 0.1978332 -0.3026545 -0.0168617 -0.1025195 0.2861786 -0.059645 0.2258443 -0.021507 0.0585432 -0.0638027 0.0619308 -0.1070404 0.0105033 -0.0990399 0.0259723 -0.0089683 -0.0554923 0.0090161 -0.0196181 0.0341041 0.0399533 0.0647135 -0.0033029 0.0495378 -0.1367077 0.1507354 -0.0257089 0.0067258 0.327927 0.1310924 0.1942766 -0.2919314 0.0068309 0.0061738 0.031105 0.0706254 -0.0106156 0.0063409 -0.1479371 -0.04783 0.0001418 -0.0299847 0.0358813 -0.0230137 -0.0005455 0.0486247 -0.0178741 0.0557282 0.0012324 0.1106554 0.0311353 -0.1163217 -0.0654407 0.0259129 -0.134798 -0.1426533 0.1241126 -0.0568429 -0.0110318 0.0353495 0.1024879 0.064509 0.0205595 -0.0050771 0.0835713 -0.1489425 -0.0192486 0.0019283 -0.0777971 0.0268881 -0.1972997 -0.0736083 -0.1094364 -0.0788552 0.0208556 0.0033244 -0.1158107 0.0092202 0.0151009 -0.0017164 0.0033596 0.1351632 0.0307548 0.0598137 0.0127373 0.0572009 0.0180541 -0.1153761 0.0991373 -0.1674511 -0.1978761 -0.3024688 -0.0169366 0.102422 -0.2863451 0.0595135 0.2259124 -0.0214734 0.0584734 0.0638301 0.0618464 -0.1070292 -0.0105614 0.0990507 -0.0260135 -0.0089821 -0.0554855 0.0090325 0.0196112 0.0341168 0.0400125 -0.0646101 0.0033233 -0.0494355 -0.1367899 0.1507778 -0.0257083 -0.0067773 0.3277205 0.1311654 -0.194212 0.2921462 -0.0068123 0.0060552 0.0311261 0.0705835 0.0106723 0.0063042 -0.1480057 0.0477063 -0.0001427 0.0298651 0.0359382 -0.0230148 -0.0004952 -0.0486206 -0.0177632 0.0557526 -0.0011011 -0.1106611 -0.0309953 -0.1163528 -0.0654826 0.0258644 0.1348236 -0.1426035 0.1241123 0.0568067 0.0109014 -0.03534 0.1025388 0.0645308 0.0205046 0.0051 0.0835164 -0.1490177 0.0191416 -0.0018466 0.0776848 0.0269513 -0.19735 -0.0736361 0.1093708 -0.0788901 0.0208975 -0.0033512 0.1157373 -0.0092439 0.015106 -0.001689 0.003467 -0.1351497 0.0308041 0.0598241 -0.0125752 -0.0571715 -0.0179218 -0.1154271 0.0189216 0.0794028 -0.0903115 -0.0025897 -0.0107841 0.0524166 -0.0403333 0.1157426 -0.0349407 0.0188936 0.0793805 0.0903283 -0.002585 -0.010765 -0.0524289 0.040353 -0.115717 -0.0350117 unknown
polarizability: 241.0828805|27.7315194|149.4045835|0.0041886|-0.0018571|155.358639 unknown
InChI: InChI=1/6C.2Te.14H
charge 0 multiplicity 1
22 atoms
C  2.23034235 -0.16644568 -0.49913653
H  2.36990947 -1.19212615 -0.83589671
H  1.59706316 -0.16988527 0.38653885
C  3.56176437 0.52336138 -0.23033679
H  3.39198231 1.56466041 0.06010468
H  4.1619325 0.54581481 -1.14491299
C  4.34648465 -0.18918067 0.87435288
H  4.56037337 -1.22570969 0.60084122
H  5.30018647 0.31090117 1.06094824
H  3.78566897 -0.20011201 1.8127257
C  -2.23024826 0.16655334 -0.49894116
H  -2.3695755 1.19245055 -0.83514075
H  -1.59707273 0.16936899 0.38681045
C  -3.56183726 -0.52314866 -0.2306929
H  -3.39229981 -1.56466949 0.05909791
H  -4.16192362 -0.54489388 -1.14533948
C  -4.34651067 0.18883986 0.8743852
H  -4.56014635 1.22559515 0.60153386
H  -5.3003402 -0.3111574 1.0605544
H  -3.78578666 0.19903057 1.81282077
Te -1.10079993 -0.85655054 -2.07727072
Te 1.10083342 0.8573037 -2.07701054
