program: Gaussian 09
title: 000052827
version: EM64L-G09RevD.01
frameworkgroup: C1[X(C23H26FNO3)]
method: RPBEPBE
basis: SDD
operation: Freq
keyword: #p
keyword: freq=noraman
keyword: PBEPBE/SDD
title: #p freq=noraman PBEPBE/SDD
converged: NO YES NO NO
title: Mulliken charges:
elementType: F O O O N C C C C C C C C C C C C C C C C C C C C C C C H H H H H H H H H H H H H H H H H H H H H H H H H H
charge: -0.197939 -0.254801 -0.251421 -0.227109 -0.077196 0.222617 -0.493948 -0.470672 -0.159859 -0.390097 -0.409182 0.274891 0.179974 -0.341034 -0.417408 -0.448583 -0.371736 -0.256962 -0.210292 -0.505465 -0.501647 0.118848 0.293967 -0.309772 -0.320276 -0.387124 -0.371894 0.331763 0.225202 0.226174 0.198026 0.239695 0.224253 0.229994 0.177190 0.208407 0.211823 0.193726 0.195784 0.236231 0.235875 0.219961 0.246153 0.223428 0.226345 0.271428 0.225158 0.244506 0.202362 0.232398 0.254424 0.284090 0.258616 0.261109
chargesum: 0.00000
title: Mulliken charges with hydrogens summed into heavy atoms:
elementType: F O O O N C C C C C C C C C C C C C C C C C C C C C C C
charge: -0.197939 -0.254801 -0.251421 -0.227109 -0.077196 0.222617 -0.042572 -0.032951 0.064394 0.017087 0.011048 0.274891 0.179974 0.048476 -0.181178 0.007253 -0.125583 -0.033534 0.016053 -0.008879 0.177619 0.118848 0.293967 -0.055348 -0.036186 -0.128508 -0.110785 0.331763
polarizability: 3.10348166e+02 -2.19964020e+01 2.78763042e+02 -3.66872633e+00 1.59944457e+01 2.00925007e+02
1716.lowfreq: -4.9198 -0.0002 0.0005 0.0008 3.1598 7.2668 9.8914 13.8062 14.8726
frequency: 9.8313 13.1713 14.5505 37.7862 47.1213 49.3367 74.4731 93.4408 99.8395 114.7303 128.1034 140.4254 151.9417 170.5715 194.4905 200.5418 220.1335 244.2199 257.5830 276.6809 286.4049 302.1868 311.3446 325.6553 331.6052 373.1026 376.8343 390.4349 411.2428 429.1516 464.1050 472.5003 480.3130 485.5650 490.2298 527.8154 532.0581 564.2131 570.1753 572.1326 582.1851 624.1747 633.1375 648.7692 714.9373 727.0977 746.1541 753.6558 756.4271 761.1892 794.6766 803.9460 810.2033 812.5223 822.2735 840.9620 848.6021 858.3173 881.8217 893.0280 930.8315 933.5548 948.7659 954.1131 957.6924 964.8699 971.9049 989.6073 995.9132 1005.6662 1012.9570 1020.0182 1023.6156 1051.2951 1058.1826 1067.7607 1091.8325 1096.8852 1105.0017 1115.1117 1116.4556 1126.5354 1136.0277 1139.0722 1156.0748 1156.7321 1161.0356 1168.7148 1186.4976 1191.4134 1201.9422 1209.5781 1228.6333 1244.7928 1262.5191 1269.9227 1274.2207 1280.2766 1288.9494 1293.8849 1309.1573 1313.7946 1328.2551 1333.7455 1337.8520 1353.5989 1357.3683 1366.7514 1379.2831 1389.0541 1399.5374 1408.6931 1430.2299 1438.6750 1443.9971 1446.1963 1453.9469 1455.1206 1462.7661 1464.8971 1471.5847 1475.0161 1479.6038 1483.8217 1490.1398 1570.3782 1600.7391 1605.6403 1611.5886 1619.0521 2816.5500 2852.6424 2867.3137 2946.5129 2956.9946 2994.5276 2996.9644 3000.2059 3002.2649 3002.7810 3010.7834 3024.6183 3042.0798 3057.5081 3063.0263 3066.4192 3084.8666 3124.3514 3125.1446 3136.9117 3154.6439 3157.0213 3157.4286 3172.8005 3177.1001 3180.1473
redmass: 7.3606 5.0454 5.3074 4.8928 4.7853 5.0448 4.4779 5.3385 4.0367 2.7162 3.0649 1.8857 2.1061 3.3360 2.9687 2.6787 4.8292 2.6525 4.2817 3.6122 6.0371 3.6497 3.0943 3.1245 2.8469 4.6742 2.5324 3.2231 2.9530 3.3820 4.4430 3.4987 3.3231 3.6231 3.4910 4.0353 2.7094 4.3105 2.2197 4.9357 6.2847 7.1884 3.7537 6.4385 2.3391 3.4023 3.8340 1.4777 5.0298 2.9842 2.1114 2.7787 1.7123 5.1325 1.3151 6.5405 1.5408 1.4527 2.1287 3.6637 1.4955 2.8539 2.0685 2.3228 1.9313 2.1853 1.3067 1.3776 3.4242 2.4307 2.3301 2.0692 1.7680 3.0821 3.0582 2.1420 2.1740 2.2189 1.3610 1.9004 1.5276 2.3431 1.8531 1.9827 1.4633 1.5173 1.4744 1.4353 1.1309 1.7260 2.2271 2.3894 2.5999 1.6818 1.3433 1.1766 1.5546 1.4777 1.4788 1.2838 1.3724 1.5423 1.3821 1.3548 1.3713 1.5303 1.5797 1.4143 5.6688 1.4314 6.9368 4.0290 1.1473 1.1017 1.7106 1.3412 1.1069 1.0851 1.1232 2.3786 1.0884 1.0774 1.0540 1.0999 2.5583 7.8785 7.1727 7.2330 7.1308 7.9302 1.0716 1.0701 1.0698 1.0626 1.0372 1.0637 1.0819 1.0717 1.0873 1.0832 1.0694 1.0874 1.0868 1.1025 1.0958 1.0995 1.0979 1.1023 1.0868 1.0899 1.0887 1.0890 1.0953 1.0984 1.0964 1.0974
irintensity: 0.1981 0.2486 0.7894 0.0516 0.2668 0.4375 1.3118 4.7710 0.2108 5.3555 1.7041 0.3086 1.1485 3.7175 2.0750 2.3689 14.1003 0.5003 2.0839 1.6233 0.8629 6.7649 4.3203 1.7927 0.0688 1.7418 3.2229 3.1312 0.0744 6.9418 4.0405 2.8477 10.6508 1.8995 4.0264 11.2637 11.7079 4.1642 8.9832 1.0077 26.0205 0.3829 5.3929 0.4653 12.2120 7.0398 4.9940 69.0222 0.8196 17.5542 8.3682 69.2950 12.1897 18.5098 0.8549 177.8202 64.6404 9.0231 25.0719 23.9045 1.6573 4.6000 37.3853 8.0313 9.4578 2.1632 0.1018 0.2142 23.5148 4.7304 16.1891 32.1452 2.8866 105.6396 69.8719 32.0558 4.8485 1.6193 10.6421 23.1614 11.6194 10.4230 19.6577 20.2856 100.6413 9.0952 2.5134 0.4226 5.0633 6.6128 10.5074 75.8898 29.6554 105.6551 2.9428 7.2024 52.4791 10.3505 61.0367 1.5005 6.1100 76.1830 0.6697 17.8057 2.3072 17.8886 46.1967 2.9696 19.0758 2.2524 5.3870 16.6085 7.4985 17.4660 32.7076 7.1314 8.4627 4.7311 11.0622 68.9223 6.7065 18.3743 13.0605 13.0686 28.1748 106.2244 73.1457 18.5559 61.3353 5.8185 87.8797 50.0965 198.1654 82.1284 72.3265 19.7374 54.9624 7.5098 24.6914 10.3981 22.1181 55.5520 30.7064 27.9821 39.0167 40.7477 17.0069 19.4172 4.5741 14.8868 6.4992 0.0697 25.6525 16.0136 4.2427 4.5959
temp: 298.150 k
press: 1.00000 atm
elementType: 9 8 8 8 7 6 6 6 6 6 6 6 6 6 6 6 6 6 6 6 6 6 6 6 6 6 6 6 1 1 1 1 1 1 1 1 1 1 1 1 1 1 1 1 1 1 1 1 1 1 1 1 1 1
symmnumber: 1
zpe: 1156735.5 jmol-1
zpe.correction: 0.440577 hartree
zpe.thermalcorrener: 0.466195 hartree
zpe.thermalcorrenthalpy: 0.467139 hartree
zpe.thermalcorrgfe: 0.381112 hartree
zpe.sumelectzpe: -1270.225595 hartree
zpe.sumelectthermal: -1270.199977 hartree
zpe.sumelectthermalent: -1270.199033 hartree
zpe.sumelectthermalfe: -1270.285060 hartree
dipole: 1.6802 -1.3568 2.0252
dipole: 2.9606
quadrupole: -174.2146 -159.4408 -167.0288
quadrupole: -5.5616 -4.8092 -4.6874
quadrupole: -7.3198 7.4539 -0.1341 -5.5616 -4.8092 -4.6874
hfenergy: -1270.6661724 hartree
pointgroup: C01 [X(C23H26F1N1O3)]
dipole: 0.6562998 0.6218262 -0.7344183 debye
polarizability: 308.2485349|22.3542897|277.5018649|7.2888811|22.7936454|204.285815 unknown
InChI: InChI=1S/C23H26FNO3/c1-27-22-23(19-5-2-3-7-21(19)28-22)12-15-25(16-13-23)14-4-6-20(26)17-8-10-18(24)11-9-17/h2-3,5,7-11,22H,4,6,12-16H2,1H3
charge 0 multiplicity 1
54 atoms
F  -7.438984 -2.882597 -1.20736
O  4.980746 0.190802 1.119765
O  4.627273 1.7095 -0.719978
O  -4.05116 1.615292 1.861811
N  0.308382 1.811688 -0.29741
C  2.810456 0.190313 -0.037498
C  1.683754 0.216423 1.045692
C  2.196829 0.596759 -1.400444
C  4.00255 1.101696 0.419122
C  0.882519 1.533492 1.042459
C  1.389424 1.905025 -1.31598
C  3.483491 -1.183611 -0.052861
C  4.705686 -1.115649 0.650328
C  -0.569679 3.010843 -0.308634
C  3.051324 -2.415942 -0.570254
C  -1.906414 2.788402 0.430935
C  5.525614 -2.232214 0.868772
C  3.86072 -3.565784 -0.372819
C  5.079697 -3.47131 0.34137
C  -2.692809 1.606779 -0.163855
C  5.757578 2.58564 -0.368715
C  -3.859921 1.140771 0.701383
C  -4.78278 0.080566 0.160407
C  -4.581818 -0.539247 -1.10325
C  -5.892721 -0.317892 0.956065
C  -5.466091 -1.534299 -1.56874
C  -6.788353 -1.30673 0.508777
C  -6.550918 -1.892452 -0.74904
H  2.118193 0.043398 2.049043
H  0.991184 -0.620292 0.838136
H  1.516528 -0.213761 -1.725499
H  2.996495 0.70126 -2.152297
H  3.747581 1.862741 1.182931
H  0.063859 1.454853 1.779305
H  1.535274 2.384778 1.376497
H  2.084861 2.754217 -1.09533
H  0.92242 2.111202 -2.297392
H  -0.051112 3.901598 0.129958
H  -0.778069 3.253704 -1.369591
H  2.106012 -2.495482 -1.119615
H  -1.743332 2.610625 1.508874
H  -2.506173 3.716455 0.371657
H  6.466934 -2.145554 1.418903
H  3.540562 -4.532981 -0.774738
H  5.693764 -4.367014 0.487406
H  -1.984108 0.762302 -0.310568
H  -3.06513 1.860954 -1.177271
H  6.575667 1.999758 0.085695
H  5.436154 3.379981 0.336428
H  6.090625 3.037996 -1.31472
H  -3.731333 -0.255681 -1.730578
H  -6.027887 0.167154 1.928078
H  -5.327421 -2.024328 -2.536537
H  -7.647441 -1.623748 1.106776
