program: Gaussian 09
title: 000052792
version: EM64L-G09RevD.01
frameworkgroup: C1[X(C9H14N2)]
method: RPBEPBE
basis: SDD
operation: Freq
keyword: #pfreq=noraman
keyword: PBEPBE/SDD
title: #p freq=noraman PBEPBE/SDD
converged: YES YES NO NO
title: Mulliken charges:
elementType: N N C C C C C C C C C H H H H H H H H H H H H H H
charge: -0.288988 -0.427544 -0.339458 -0.369892 0.454220 -0.676554 -0.427761 -0.371885 -0.195424 -0.196072 -0.276543 0.175747 0.229273 0.223639 0.186805 0.267546 0.260089 0.208711 0.214093 0.221323 0.212233 0.262251 0.216485 0.215947 0.221758
chargesum: 0.00000
title: Mulliken charges with hydrogens summed into heavy atoms:
elementType: N N C C C C C C C C C
charge: -0.021442 -0.167455 0.065563 0.040552 0.454220 -0.032427 -0.215528 -0.109634 0.021061 0.019875 -0.054785
polarizability: 1.53522140e+02 7.51200332e+00 1.09299938e+02 1.49825688e+01 -6.95722258e+00 7.31444173e+01
1716.lowfreq: -6.8770 -0.0005 -0.0004 0.0005 6.6407 16.0136 34.3303 52.1227 67.5577
frequency: 34.2586 51.7677 67.5262 112.8468 175.8115 223.1281 227.7645 251.9964 321.2444 389.8775 409.4659 473.9706 500.7284 517.9460 593.5744 613.8216 693.4066 708.3397 756.3593 760.0015 815.8191 827.5791 888.7742 891.8404 908.4259 958.9850 978.7894 980.5677 1015.5582 1020.6371 1067.9922 1078.3243 1123.9814 1138.4466 1162.6755 1168.9517 1175.5745 1231.3856 1280.1977 1285.7996 1303.9599 1310.2541 1364.1497 1380.7895 1393.3586 1424.3572 1453.7210 1472.0268 1478.9802 1480.4987 1484.7145 1493.1145 1514.8403 1595.9252 1621.0183 2866.0657 2968.1316 2978.3228 3023.1459 3042.2065 3075.8279 3080.0012 3105.0383 3122.6969 3134.1458 3158.0240 3170.7870 3409.1124 3419.9942
redmass: 4.1478 3.7595 1.5872 2.5798 3.5333 2.9828 1.3243 2.5260 4.3694 2.0549 2.9656 1.7676 2.7881 3.5637 3.0744 6.3518 2.0163 1.5643 1.7474 1.0929 4.1936 1.2860 1.4479 1.1940 1.6369 1.3455 4.1107 1.4298 2.6567 2.3193 2.1941 1.7169 1.9186 3.5690 1.2367 1.4741 1.2272 1.2987 1.1321 1.6979 1.3350 1.6806 1.4981 3.2406 1.2072 1.9556 1.5099 1.0881 1.3105 1.0510 1.2895 1.2427 1.6940 4.9228 6.2090 1.0712 1.0644 1.0360 1.0872 1.0977 1.1007 1.0994 1.0870 1.0863 1.0932 1.0967 1.0968 1.0757 1.0753
irintensity: 0.7297 0.5815 0.5697 4.2345 0.0932 1.1662 1.5121 5.0174 1.0113 15.4992 0.0546 92.8048 35.8611 13.7916 15.5410 0.6836 52.9729 73.4449 83.4442 5.1222 1.6679 0.7668 10.8049 4.0164 6.4376 0.1614 2.4065 2.7401 2.4138 9.1382 4.9666 7.2925 4.2892 23.3192 2.1034 5.9721 3.8891 2.3811 2.0402 30.4082 2.0828 14.7917 1.5405 18.1217 12.1936 5.2117 23.1950 6.8196 14.0035 19.7793 33.3799 11.8652 50.8012 3.2952 161.1637 102.4012 37.6586 35.4719 12.3638 17.3368 73.2543 46.6527 16.7567 1.6380 38.9386 31.4805 8.3644 22.4910 8.6162
temp: 298.150 k
press: 1.00000 atm
elementType: 7 7 6 6 6 6 6 6 6 6 6 1 1 1 1 1 1 1 1 1 1 1 1 1 1
symmnumber: 1
zpe: 563497.0 jmol-1
zpe.correction: 0.214625 hartree
zpe.thermalcorrener: 0.226001 hartree
zpe.thermalcorrenthalpy: 0.226945 hartree
zpe.thermalcorrgfe: 0.176270 hartree
zpe.sumelectzpe: -459.980402 hartree
zpe.sumelectthermal: -459.969026 hartree
zpe.sumelectthermalent: -459.968082 hartree
zpe.sumelectthermalfe: -460.018757 hartree
dipole: -2.8344 -1.4538 0.2475
dipole: 3.1951
quadrupole: -62.6311 -60.7726 -69.7856
quadrupole: 1.4115 3.5228 -1.0029
quadrupole: 1.7653 3.6238 -5.3891 1.4115 3.5228 -1.0029
hfenergy: -460.1950271 hartree
pointgroup: C01 [X(C9H14N2)]
dipole: 1.1215339 -0.5308306 0.2012609 debye
dipolederiv: -0.1832033 0.1233172 0.0847395 0.3926034 -0.4172658 0.0287144 0.1700173 -0.0301083 0.0415688 -0.8191821 0.2734106 -0.1638383 0.2830126 0.0843365 0.0744986 -0.3929385 0.1877151 -0.728634 0.3033653 -0.1885994 -0.1062244 -0.2243871 0.358941 -0.0691177 -0.2755387 0.0189225 0.2244765 -0.0106057 -0.0099843 0.0814381 0.0311457 0.079446 -0.024267 0.1308877 -0.0236819 0.1455845 1.2240945 -0.323972 0.443661 -0.5930284 0.0605501 -0.1569265 0.6251306 -0.1542109 0.3418903 -0.0394358 -0.0052207 0.0519437 -0.0572447 0.0827934 -0.016755 0.0220398 -0.0190643 0.0414225 -0.4721773 0.1873951 -0.08761 -0.1524815 0.0654697 -0.1284174 -0.0409782 0.0026735 -0.2402097 -0.2692836 0.0227115 -0.0053854 0.4574922 -0.1154752 0.1182716 -0.0988556 -0.00802 -0.2386085 0.1448113 -0.0662042 0.1229466 0.033972 0.1841457 -0.0470345 0.0985902 -0.0964819 -0.0736067 0.2196556 0.0946062 0.1130584 -0.026015 0.1620392 -0.0683798 0.1530458 -0.0284722 -0.0753407 -0.1750987 -0.0575745 0.0554228 -0.059321 -0.249355 -0.0247904 0.0366664 -0.0182381 -0.208463 -0.0877459 0.0680078 0.0401924 0.153883 -0.2534629 -0.0144724 0.051912 0.045017 0.0230794 0.0297015 0.0028439 -0.0733627 0.0183508 0.0435849 0.0123274 -0.0408449 -0.0084784 -0.1234567 0.0396649 0.0902052 0.0061282 0.0484044 -0.1392603 0.0110369 0.0017794 0.0202506 0.0695798 0.0228324 -0.0099035 -0.0492108 -0.0105154 0.0697134 0.0298207 -0.077311 -0.0134946 -0.205579 -0.0097972 -0.0512221 -0.1045524 -0.0319392 0.252806 0.0631577 -0.0308323 -0.0170544 0.0174746 0.0056734 -0.0133825 -0.0599418 -0.1418602 -0.0513668 0.0239512 -0.0267753 -0.0656749 0.3332144 0.0594333 0.0603681 0.0109619 0.1267606 -0.1461675 0.0195576 -0.0014044 0.0529995 0.0664344 0.0571952 0.0154839 -0.1007959 0.0250309 0.090762 0.0041447 -0.0346063 0.0039916 -0.1545083 -0.1393853 -0.1223587 0.0119982 -0.152871 -0.0056342 -0.0105847 0.0067868 -0.0242612 0.0874877 0.0842135 0.0576543 -0.0498967 0.0279192 -0.1174318 0.0720885 -0.0398616 0.0797598 0.1311497 0.057532 -0.1005262 -0.0355318 -0.1120453 0.037646 0.0013805 -0.0347024 -0.0060627 0.1436394 -0.0465675 -0.1161977 -0.0488007 -0.1292143 -0.0124373 -0.0144883 -0.0518406 -0.0107617 0.135715 0.0869678 0.0155245 -0.0260617 0.0373299 -0.1293299 0.0696982 -0.0333166 0.0663935 0.1232459 -0.0826583 0.0536175 -0.1112783 0.0550181 0.064953 0.0465856 -0.1170496 0.0463423 0.1224437 unknown
polarizability: 152.1198387|1.1383605|107.9990346|19.9145418|-9.2569572|75.8476223 unknown
InChI: InChI=1S/C9H14N2/c1-2-8-10-11-9-6-4-3-5-7-9/h3-7,10-11H,2,8H2,1H3
charge 0 multiplicity 1
25 atoms
N  1.47341 -0.045171 1.136179
N  0.317499 -0.858004 1.101192
C  2.529288 -0.400698 0.153933
C  3.738253 0.544363 0.297424
C  -0.865981 -0.396715 0.486888
C  4.870677 0.197108 -0.692348
C  -1.929988 -1.315752 0.255949
C  -1.035322 0.967387 0.122853
C  -3.13618 -0.872924 -0.324199
C  -2.248305 1.39317 -0.458497
C  -3.308738 0.48434 -0.687841
H  2.871421 -1.460663 0.267125
H  2.094041 -0.305462 -0.85839
H  3.39439 1.58379 0.138628
H  4.127531 0.492248 1.336052
H  1.832319 0.045861 2.09684
H  0.440026 -1.877031 1.170234
H  5.24928 -0.828826 -0.525194
H  4.516636 0.259621 -1.738167
H  5.721555 0.893088 -0.582466
H  -1.809675 -2.370877 0.535552
H  -0.211399 1.662732 0.306446
H  -3.945488 -1.593014 -0.493974
H  -2.365698 2.448016 -0.73475
H  -4.246951 0.824014 -1.139069
