program: Gaussian 16
title: TitleCard Required
version: EM64L-G16RevB.01
method: RB3LYP
basis: TZVP
operation: Freq
keyword: #PGeom=AllCheck
keyword: Guess=TCheck
keyword: SCRF=Check
keyword: GenChk
keyword: RB3LYP/TZVP
keyword: Freq
title: Title Card Required
converged: YES YES YES YES
title: Mulliken charges:
elementType: C C H H H C H H H C H H H O K O C C H H C C H H H H O H H
charge: 0.244480 -0.354700 0.082684 0.082597 0.074471 -0.352188 0.082614 0.082160 0.073681 -0.354663 0.082214 0.082823 0.074414 -0.795892 0.880649 -0.399374 -0.089903 -0.090402 0.134479 0.133173 -0.091926 -0.092975 0.134186 0.139365 0.146422 0.111126 -0.278436 0.111557 0.147364
chargesum: -0.00000
title: Mulliken charges with hydrogens summed into heavy atoms:
elementType: C C C C O K O C C C C O
charge: 0.244480 -0.114950 -0.113734 -0.115212 -0.795892 0.880649 -0.399374 0.177749 0.183149 0.165623 0.165947 -0.278436
chargesum: 0.00000
polarizability: 1.42115142e+02 -4.07610557e+00 1.33130423e+02 -2.07942491e+00 6.37510485e-01 1.43736008e+02
1716.lowfreq: -11.1065 0.0029 0.0031 0.0038 10.2413 11.9611 22.5224 23.6035 39.9053
frequency: 18.8727 22.3414 39.4059 39.9702 47.2134 59.2731 83.9435 101.4556 227.9809 233.1952 263.5637 289.3000 292.0150 296.0095 351.4972 352.9645 434.8556 454.7352 459.3760 486.1427 487.4089 488.2084 627.5200 737.1655 836.2337 857.6489 858.6966 867.3247 877.1307 903.4802 937.4652 1021.4594 1024.8295 1031.8012 1032.6766 1065.9616 1093.7496 1110.2308 1124.7264 1148.9904 1216.0468 1216.3118 1236.6136 1249.0783 1291.2756 1327.2314 1342.7647 1370.3678 1371.5046 1373.5656 1397.1807 1404.7610 1421.0537 1433.8153 1469.1026 1479.6823 1480.3089 1486.4660 1488.1751 1490.6385 1491.5509 1499.3401 1503.9547 1509.4268 2983.3764 2988.2112 2988.7303 2989.7109 3001.6611 3011.5731 3015.0294 3051.0366 3051.9525 3063.2775 3066.0248 3072.8728 3073.9130 3095.3909 3098.0355 3101.3757 3103.0167
redmass: 4.5804 5.6286 3.5489 4.0722 4.2572 4.5953 6.1034 7.9696 1.0136 8.4944 1.7559 3.0188 1.0485 1.0472 2.4548 2.4414 1.9997 6.0565 2.4580 2.6757 2.9940 2.9999 1.6596 3.4754 4.1441 1.8036 1.8052 1.6959 3.5005 2.5459 1.1956 2.4546 2.4780 1.3815 1.3801 2.2268 3.8553 2.2775 5.2593 2.1101 2.6637 2.6769 3.5190 1.0596 1.1368 1.2294 1.1450 1.2521 1.2498 1.2070 1.2293 1.2829 1.2858 1.3964 1.0525 1.0469 1.0467 1.0810 1.0832 1.0570 1.0569 1.1060 1.0995 1.0498 1.0710 1.0365 1.0366 1.0711 1.0363 1.0656 1.0665 1.0977 1.0977 1.0977 1.1037 1.1013 1.1013 1.0982 1.0990 1.0946 1.0956
irintensity: 2.4482 4.7599 1.4809 0.8232 18.9639 20.2849 5.6706 8.6677 0.0380 32.6249 2.0512 31.6005 0.0824 0.0899 4.9601 5.2201 0.0183 0.1609 21.6271 0.0218 13.3198 13.2837 22.4604 0.0261 6.2801 7.9861 7.8516 1.4685 98.6818 33.2886 0.0007 3.6218 104.4695 0.1423 0.2133 12.8278 107.1581 0.8703 132.5987 0.0983 29.1075 29.5749 223.3720 0.2069 39.1644 12.5658 1.0962 20.1612 20.5382 1.1397 1.7682 14.1161 4.6550 0.0372 0.0045 0.3205 0.2464 0.2700 1.8721 3.7373 3.7599 21.6023 1.3773 0.4791 34.0195 67.2941 67.5723 68.5507 69.8264 16.5224 76.3237 12.4374 14.1643 204.5621 1.8214 114.5367 113.6124 41.1156 32.5695 26.2856 19.0213
temp: 298.150 k
press: 1.00000 atm
elementType: 6 6 1 1 1 6 1 1 1 6 1 1 1 8 19 8 6 6 1 1 6 6 1 1 1 1 8 1 1
symmnumber: 1
zpe: 645936.9 jmol-1
zpe.correction: 0.246024 hartree
zpe.thermalcorrener: 0.261625 hartree
zpe.thermalcorrenthalpy: 0.262569 hartree
zpe.thermalcorrgfe: 0.198776 hartree
zpe.sumelectzpe: -1140.687861 hartree
zpe.sumelectthermal: -1140.672261 hartree
zpe.sumelectthermalent: -1140.671317 hartree
zpe.sumelectthermalfe: -1140.735109 hartree
dipole: -11.2695 3.9878 1.3877
dipole: 12.0345
quadrupole: -18.7154 -71.8943 -76.8160
quadrupole: -30.0509 -7.8719 3.2198
quadrupole: 37.0932 -16.0858 -21.0074 -30.0509 -7.8719 3.2198
hfenergy: -1140.9338858 hartree
pointgroup: C01 [X(C8H17K1O3)]
dipole: -4.4337519 1.568923 0.545978 debye
polarizability: 142.115142|-4.0761056|133.1304226|-2.0794249|0.6375105|143.7360084 unknown
InChI: InChI=1/8C.K.3O.17H
charge 0 multiplicity 1
29 atoms
C  -0.61961721 0.68121359 -0.047224
C  0.17399694 0.73336723 1.28325362
H  0.21783088 1.767204 1.63870747
H  -0.35014101 0.1420749 2.03999284
H  1.19930397 0.35387022 1.19637477
C  -0.65410902 -0.79028488 -0.53332042
H  -1.18572013 -1.40213938 0.20140009
H  -1.20512365 -0.84745552 -1.47669953
H  0.34191992 -1.22247551 -0.68782217
C  0.14460128 1.52205401 -1.10164278
H  -0.39889988 1.49286036 -2.05078005
H  0.18657525 2.56472517 -0.77256899
H  1.16941026 1.17409362 -1.27925208
O  -1.88738315 1.16209251 0.12778903
K  -4.07375233 2.06531454 0.45375509
O  -6.80591431 1.77885179 0.22339065
C  -7.65024518 1.41778778 1.33115212
C  -7.41524667 1.39584357 -1.02347993
H  -7.16178382 1.77822341 2.23837432
H  -7.73553991 0.32540362 1.38220118
C  -9.02410529 2.04390513 1.17815906
C  -8.79093826 2.02209548 -1.15592221
H  -7.48952113 0.30261913 -1.07010108
H  -6.75656038 1.74046975 -1.822513
H  -9.68595187 1.70580823 1.97662358
H  -8.94131786 3.13875311 1.2288518
O  -9.62360247 1.65509524 -0.05655561
H  -8.69776117 3.11591468 -1.20931575
H  -9.28297889 1.66817266 -2.06275691
