program: Gaussian 09
title: 000052780
version: EM64L-G09RevD.01
frameworkgroup: C1[X(C11H10N2O3)]
method: RPBEPBE
basis: SDD
operation: Freq
keyword: #p
keyword: freq=noraman
keyword: PBEPBE/SDD
title: #p freq=noraman PBEPBE/SDD
converged: YES YES NO NO
title: Mulliken charges:
elementType: O O O N N C C C C C C C C C C C H H H H H H H H H H
charge: -0.189447 -0.422193 -0.470343 -0.104613 -0.096946 -0.487230 0.341750 0.118552 -0.457150 -0.330148 -0.158314 0.177821 -0.213064 -0.354507 0.159651 -0.322619 0.255749 0.244862 0.303308 0.241733 0.262067 0.252887 0.229346 0.249994 0.387906 0.380947
chargesum: 0.00000
title: Mulliken charges with hydrogens summed into heavy atoms:
elementType: O O O N N C C C C C C C C C C C
charge: -0.189447 -0.034287 -0.089396 -0.104613 -0.096946 0.013382 0.341750 0.118552 -0.153842 -0.088415 0.103753 0.177821 0.039822 -0.125161 0.159651 -0.072626
polarizability: 2.22526278e+02 -1.49887190e+01 1.28077667e+02 2.94426658e+00 3.75292506e+00 8.14235005e+01
1716.lowfreq: -6.9268 -0.0008 -0.0005 -0.0004 4.6692 5.7560 13.0990 25.7762 57.1716
frequency: 12.8267 25.6811 57.1629 70.3319 106.0448 149.8588 205.9840 233.4542 284.6579 293.6709 308.0534 327.1068 329.1022 379.6994 437.7833 483.5192 505.1287 510.8382 561.4613 591.4654 616.2693 629.8742 651.2832 704.4225 719.7445 723.9666 760.8993 763.0335 783.3621 799.0918 841.6178 875.8185 879.3947 905.6975 920.9704 962.8159 1003.3256 1017.7249 1055.1723 1079.7686 1108.2330 1149.0104 1161.1154 1171.1165 1189.4509 1225.0137 1249.2490 1270.0438 1275.9220 1306.5142 1315.2886 1348.0602 1363.9489 1412.0735 1435.9216 1459.7683 1470.2940 1483.5109 1504.9318 1588.5417 1608.2587 1628.9860 2985.0087 3050.6685 3128.3653 3165.8806 3175.0746 3225.3500 3227.1274 3256.5641 3528.9034 3617.1349
redmass: 4.4541 7.0761 4.9003 5.1459 6.8171 6.3499 5.4471 7.7637 5.2049 4.8931 3.2118 1.2884 2.7020 7.4810 3.3100 1.1218 5.1057 3.3959 5.8936 6.2739 3.2315 3.4798 3.3411 5.7461 1.3075 3.9681 2.9306 1.8469 1.4004 5.2338 1.4399 5.7994 6.1872 1.4148 1.3943 2.3041 3.3341 2.7372 1.7170 2.0791 1.8199 1.2998 1.6909 1.4190 1.6360 1.5456 2.5319 1.9293 2.3316 1.5551 1.6278 3.9669 3.3819 6.6806 1.7213 2.2913 2.4220 3.2379 3.2084 7.7712 7.7890 7.3001 1.0622 1.0979 1.0895 1.0940 1.0926 1.0961 1.0928 1.1096 1.0650 1.0667
irintensity: 2.9464 0.4517 2.4314 2.6020 0.9912 1.0192 0.6797 0.5880 6.2111 3.0717 22.0955 156.7523 1.0976 10.1761 7.8515 142.8415 6.7573 3.4443 30.1753 19.6892 20.4086 7.4381 15.3610 11.8735 20.7348 0.1337 25.9369 77.3667 55.0727 3.3930 4.8758 27.8968 8.5739 5.5004 16.0780 1.5742 10.2625 41.1495 44.9430 280.3628 14.1483 16.2591 23.3177 11.3205 75.9132 32.6630 394.0532 7.2744 164.4690 39.2024 69.2790 4.9094 2.0109 5.5766 29.2220 8.5140 38.8592 49.6092 95.7428 106.1067 123.9905 3.9972 50.2329 4.8537 14.1176 7.8452 6.4295 4.6804 1.9411 2.1908 93.0131 94.7946
temp: 298.150 k
press: 1.00000 atm
elementType: 8 8 8 7 7 6 6 6 6 6 6 6 6 6 6 6 1 1 1 1 1 1 1 1 1 1
symmnumber: 1
zpe: 506339.9 jmol-1
zpe.correction: 0.192855 hartree
zpe.thermalcorrener: 0.206991 hartree
zpe.thermalcorrenthalpy: 0.207936 hartree
zpe.thermalcorrgfe: 0.149238 hartree
zpe.sumelectzpe: -759.174423 hartree
zpe.sumelectthermal: -759.160286 hartree
zpe.sumelectthermalent: -759.159342 hartree
zpe.sumelectthermalfe: -759.218040 hartree
dipole: 7.9202 -5.8411 2.0834
dipole: 10.0592
quadrupole: -101.6545 -89.2656 -92.7370
quadrupole: -12.2542 -7.5440 2.3629
quadrupole: -7.1022 5.2868 1.8154 -12.2542 -7.5440 2.3629
hfenergy: -759.3672779 hartree
pointgroup: C01 [X(C11H10N2O3)]
dipole: 3.1220739 -2.4152591 0.2860339 debye
dipolederiv: -0.9006218 0.1179745 0.0082008 0.4049194 -0.7684967 -0.0465519 0.0844053 -0.0623332 -0.2704975 -0.8957798 -0.6149292 -0.0662276 -0.7644368 -0.6889223 -0.023157 -0.0811198 -0.0235133 -0.4120793 -1.6771891 0.3221728 0.0477183 0.280369 -0.1814645 0.0247715 0.0472745 0.0235803 -0.423236 -0.960666 0.1315314 -0.0478367 0.1567482 -0.1523453 0.0136256 -0.0094504 -0.005434 -0.0508744 -0.6957658 0.0415118 -0.0458277 0.1417576 -0.264779 0.0085694 0.0297746 0.0124214 -0.2612055 0.4795182 -0.1750817 0.0056455 -0.5042375 0.0036641 -0.0623479 -0.0395733 -0.0517195 0.1993765 -1.025893 0.2561233 0.0336808 0.0050016 -0.0048442 0.0038934 0.0034055 -0.0061886 -0.0434675 1.9089896 -0.1329617 -0.0342001 -0.1197758 0.8244669 0.0670196 -0.0427462 0.0965676 0.1158278 0.006434 -0.3346191 -0.0395007 0.2051207 -0.0286184 0.0089259 0.021792 0.0132805 -0.10574 0.1592822 -0.0798783 -0.0139713 -0.1694659 -0.0232347 0.0132825 -0.0280566 0.0185729 -0.1492528 0.3040491 -0.0660871 0.0175513 -0.1407175 -0.0847045 0.0726091 -0.3417636 0.0740537 -0.1176438 0.544353 0.7168237 0.076892 1.1175995 0.5107073 0.0396453 0.1243656 0.0411359 0.0713528 0.6437494 -0.1093448 0.1465448 -0.0900561 -0.0880564 0.0100551 0.4162202 0.0149761 0.0936329 -0.3804373 0.0561802 0.0075523 -0.2370584 0.0780211 0.0301827 -0.0190601 0.0265929 -0.1556007 1.4339803 -0.2886109 -0.0467372 -0.4980324 0.0104336 0.0012211 -0.0752071 0.0005143 0.0416156 -0.0460913 -0.1198651 -0.0906771 -0.1100898 -0.1219643 0.1169917 -0.0909314 0.0780525 0.0744416 -0.0675912 0.0385989 -0.0291526 0.0856336 0.0195032 0.0572936 -0.1070502 0.09299 0.0025523 0.0016333 0.0157355 0.0146872 0.0479078 0.057937 -0.0463406 0.0846013 -0.0819174 -0.011961 0.1514967 0.0378557 0.0056269 -0.0122081 0.0532541 -0.0127073 -0.0028435 -0.0143827 0.1628477 0.023385 -0.0986533 -0.009085 -0.1229764 0.0070842 -0.0149606 -0.0157205 -0.0167633 0.1461113 0.0883094 0.0087497 -0.1012491 0.0199332 0.1814322 -0.0502804 -0.0719384 -0.0391339 0.0439373 0.0747538 0.0615949 0.0632988 0.0600296 0.1555964 -0.0708165 0.0477566 -0.0623187 0.0228353 0.0150403 0.0848561 0.010763 0.0862734 -0.0611437 -0.0272756 0.011764 -0.0279098 0.1682341 0.0172555 0.0726865 0.0784986 0.0736142 0.15115 -0.0678544 0.0447699 -0.0553129 0.059317 0.3457476 0.1452556 0.0177391 0.1600191 0.289055 -0.0143098 0.0188528 -0.0146363 0.3935329 0.4520581 -0.0876194 -0.0099342 -0.0758721 0.1262686 -0.0314847 -0.0095212 -0.0311744 0.4059435 unknown
polarizability: 222.6159761|-15.0271091|123.9138554|-0.1174789|13.6461583|85.4976136 unknown
InChI: InChI=1S/C11H10N2O3/c14-9-2-1-8(5-10(9)15)11(16)6-13-4-3-12-7-13/h1-5,7,14-15H,6H2
charge 0 multiplicity 1
26 atoms
O  -0.925998 1.497229 0.258621
O  4.157064 1.805856 0.222101
O  5.091564 -0.704326 -0.077174
N  -2.938625 -0.436167 0.00609
N  -5.04433 -0.028691 -0.739025
C  -1.543818 -0.858815 -0.002363
C  0.925168 -0.037985 0.052168
C  -0.529036 0.310092 0.110607
C  1.863424 1.026387 0.162255
C  1.391368 -1.372188 -0.106674
C  -3.642687 0.122137 1.082143
C  3.238347 0.763863 0.114438
C  -3.828575 -0.499187 -1.070138
C  2.775347 -1.641992 -0.15515
C  3.69136 -0.578607 -0.045024
C  -4.933234 0.361783 0.607748
H  -1.355976 -1.567779 0.828194
H  -1.354243 -1.410089 -0.941859
H  1.502558 2.051768 0.283627
H  0.692826 -2.209359 -0.193198
H  -3.171606 0.32167 2.040419
H  -3.542738 -0.890864 -2.044263
H  3.134888 -2.670959 -0.277086
H  -5.778415 0.791868 1.139659
H  5.079321 1.440344 0.167854
H  5.387644 -1.639687 -0.18617
