program: Gaussian 16
title: TEXT
version: EM64L-G16RevB.01
method: RB3LYP
basis: TZVP
operation: Freq
keyword: #P
keyword: Geom=AllCheck
keyword: Guess=TCheck
keyword: SCRF=Check
keyword: GenChk
keyword: RB3LYP/TZVP
keyword: Freq
converged: YES YES YES YES
title: Mulliken charges:
elementType: S C H H C H H C H H H K O C C H H C C H H H H O H H
charge: -0.740317 -0.267883 0.091550 0.094778 -0.127948 0.091945 0.090911 -0.377593 0.100320 0.101256 0.118902 0.811417 -0.408747 -0.092953 -0.093010 0.137635 0.132852 -0.089539 -0.089626 0.132893 0.138308 0.148244 0.112854 -0.277148 0.112809 0.148090
chargesum: -0.00000
title: Mulliken charges with hydrogens summed into heavy atoms:
elementType: S C C C K O C C C C O
charge: -0.740317 -0.081555 0.054908 -0.057116 0.811417 -0.408747 0.177534 0.178191 0.171559 0.171273 -0.277148
polarizability: 1.44347537e+02 7.88414855e+00 1.40238693e+02 -1.40547444e+01 -1.29054068e+01 1.58012692e+02
1716.lowfreq: -8.6898 -0.0016 0.0016 0.0025 7.5029 14.8125 21.1149 31.4531 35.2695
frequency: 17.3550 24.4510 34.8422 35.8085 45.3344 48.9063 88.7671 99.8249 121.4840 191.5536 244.0290 262.0406 265.5537 286.5533 370.3017 435.2209 453.1497 487.7837 629.4963 718.9396 757.7160 835.4003 863.4178 867.2405 877.1403 898.6367 902.6592 1020.9257 1032.0413 1050.3331 1066.0535 1091.8997 1103.9306 1110.0549 1124.9597 1149.6101 1249.0752 1249.1464 1257.0999 1291.1504 1324.1501 1327.8995 1343.4912 1361.1462 1374.0021 1406.5258 1410.5958 1421.2605 1435.7448 1482.6395 1486.3216 1489.2263 1491.0035 1497.6604 1499.8989 1504.7854 1505.1004 2981.5550 2983.3232 2990.1599 3008.4863 3010.7891 3014.2298 3018.9330 3026.5058 3051.8062 3073.1924 3077.3712 3094.6294 3098.2309 3100.4850 3104.2353
redmass: 2.1307 6.1503 3.3396 5.1288 4.7552 8.2778 5.3411 7.3242 2.4488 10.5838 1.0996 3.8774 1.7595 3.0066 4.7207 2.0863 5.6772 2.6877 1.6679 4.3431 1.0914 4.1318 1.2101 1.6951 3.4937 2.1307 2.5491 2.4467 2.9526 1.1632 2.2211 4.0544 1.9266 2.1901 5.3485 2.1207 1.3862 1.0642 1.2432 1.1396 1.1026 1.2290 1.1519 1.3902 1.2081 1.2800 1.2311 1.2860 1.3892 1.0724 1.0818 1.0824 1.0690 1.0403 1.1059 1.0984 1.0774 1.0554 1.0709 1.0712 1.1052 1.0356 1.0652 1.0660 1.0601 1.1029 1.1003 1.1043 1.0993 1.0984 1.0963 1.0950
irintensity: 9.1249 4.1361 9.9122 8.4579 2.7169 17.9939 1.8321 2.6912 3.3054 31.8522 0.0231 13.3932 1.7527 30.9768 7.8697 0.0320 0.4094 0.0222 21.6513 14.7164 4.8766 7.3846 0.3390 1.0852 103.3627 9.5178 32.9438 0.3436 0.3556 6.0450 12.3911 110.4565 5.9666 0.8431 128.5498 0.0469 1.9888 0.2581 47.8920 38.7998 0.1784 12.8852 1.1944 5.3654 1.1291 13.8706 4.0505 5.4518 0.0405 1.0423 0.8520 2.1067 0.0074 8.8797 18.2889 3.7259 6.2022 74.0450 33.3989 66.2872 17.0865 64.0928 25.1265 69.1148 28.8243 0.1213 69.9991 106.2757 39.3702 35.4891 23.4697 22.8113
temp: 298.150 k
press: 1.00000 atm
elementType: 16 6 1 1 6 1 1 6 1 1 1 19 8 6 6 1 1 6 6 1 1 1 1 8 1 1
symmnumber: 1
zpe: 572145.6 jmol-1
zpe.correction: 0.217919 hartree
zpe.thermalcorrener: 0.232806 hartree
zpe.thermalcorrenthalpy: 0.233750 hartree
zpe.thermalcorrgfe: 0.169981 hartree
zpe.sumelectzpe: -1424.364488 hartree
zpe.sumelectthermal: -1424.349600 hartree
zpe.sumelectthermalent: -1424.348656 hartree
zpe.sumelectthermalfe: -1424.412426 hartree
dipole: -4.3617 0.6675 13.1034
dipole: 13.8264
quadrupole: -151.5651 -74.8791 60.5678
quadrupole: -27.2082 85.9962 94.3901
quadrupole: -96.2730 -19.5870 115.8599 -27.2082 85.9962 94.3901
hfenergy: -1424.5824065 hartree
pointgroup: C01 [X(C7H15K1O2S1)]
dipole: -1.716023 0.2626057 5.1552684 debye
dipolederiv: -0.8462853 -0.0440089 0.0808065 -0.0618069 -0.8397236 0.111735 0.0556503 0.0713636 -0.8460209 0.2102485 0.1635063 -0.122585 0.2521679 0.4034988 -0.2633452 0.0213259 0.0075566 0.0232895 -0.0101223 0.0554492 0.0520544 0.0277487 -0.2831818 -0.0116147 0.0413179 -0.0135707 0.007363 -0.1753753 -0.1423408 -0.0877481 -0.1240637 -0.0537108 -0.004292 -0.0900839 -0.0254999 -0.0546686 0.1222839 -0.0316221 0.0911628 -0.0961083 0.0643149 0.1457557 -0.0275379 -0.075734 0.1174818 -0.0309348 0.0714963 0.0448592 0.105185 -0.1168319 -0.0710161 0.019119 -0.0212557 0.0307662 -0.0972695 -0.0178854 -0.1435931 -0.0313872 0.0239593 -0.0166073 -0.0805167 -0.0033724 -0.0468599 0.1053633 -0.1113758 0.0607848 -0.0916461 0.0370022 0.0478423 0.0988823 0.1165272 0.054598 -0.0456846 0.1420002 0.0368111 0.0716341 -0.1256623 -0.0231443 0.0332989 -0.0716043 0.0555647 -0.1093677 -0.0418176 -0.1068484 -0.0014674 0.0294031 0.0233254 -0.1585149 -0.0311709 -0.0342205 0.0119944 -0.0631846 0.1079196 -0.0568089 0.0020512 0.0595808 0.1212473 0.083988 -0.1933099 0.8050767 0.022238 -0.0817905 0.0051017 0.7908078 0.0174877 -0.1068017 -0.029198 1.0072356 -1.0343131 0.2121927 -0.0770088 0.2180262 -0.622404 0.0055574 -0.0677121 0.0258749 -0.9350809 0.4323488 -0.0623076 0.1733557 -0.0487445 0.384428 -0.1609664 0.3079846 -0.1998399 0.5905064 0.7830319 -0.113724 -0.0836762 -0.117352 0.3741083 -0.0286344 -0.2028755 0.0393201 0.2651898 -0.1200666 0.0699759 0.0386516 0.0418637 0.0583457 0.0047625 0.0731996 -0.0371897 0.0202047 -0.0018526 -0.1280098 0.0173684 -0.0394013 -0.107736 0.0628808 -0.0383406 0.0587732 -0.028085 0.7841247 -0.0944796 -0.0324286 -0.1049669 0.4008859 -0.0307178 -0.2007699 0.0433824 0.263513 0.4481536 -0.0604264 0.1532906 -0.0490695 0.4201554 -0.1347818 0.3196818 -0.2043023 0.5632866 -0.0473207 -0.0168994 0.0306785 -0.1018773 -0.1222258 0.0283125 0.0910736 0.0425302 0.0289969 0.0035233 0.0400486 -0.0454538 0.0497519 0.047022 0.0616877 -0.1049857 0.0436464 -0.0917703 -0.0009998 0.0437502 -0.0460992 0.0588204 0.0474639 0.0571896 -0.0966592 0.0432281 -0.0704899 -0.0674535 -0.0280535 0.0236147 -0.1118902 -0.1363986 0.0367078 0.1089473 0.0541002 0.0220766 -0.9931668 0.2031128 -0.1366076 0.2089726 -0.6126017 0.0101661 -0.1293158 0.027171 -0.7388975 -0.0119775 -0.1354729 0.0289723 -0.0408215 -0.1285069 0.0695798 -0.042621 0.0824996 -0.0384386 -0.1139592 0.0678384 0.0235091 0.0381394 0.0655369 0.002549 0.0550064 -0.0272236 0.027769 unknown
polarizability: 144.347537|7.8841485|140.2386926|-14.0547444|-12.9054068|158.0126916 unknown
InChI: InChI=1/7C.K.2O.S.15H
charge 0 multiplicity 1
26 atoms
S  8.83580808 7.01232777 3.94057114
C  9.73802027 8.62691936 3.73650929
H  9.07623396 9.46017602 3.99916629
H  10.58708835 8.66582084 4.42814497
C  10.25533942 8.84461727 2.31513426
H  10.90826725 8.00876409 2.04663937
H  9.40912823 8.8079705 1.62254849
C  11.00693479 10.16803444 2.1515243
H  10.36416751 11.02194495 2.38808698
H  11.87578425 10.21612017 2.81556927
H  11.36732095 10.30082042 1.12730917
K  7.84444894 7.08152038 6.8161812
O  6.94545831 7.22010741 9.40243908
C  7.68986179 6.76561244 10.54840842
C  5.61671113 7.61851369 9.7896021
H  8.69750486 6.52495118 10.2047001
H  7.22347143 5.85578589 10.9448708
C  7.73073792 7.84316236 11.61579518
C  5.67559119 8.68822556 10.86413963
H  5.06964628 6.74189896 10.15640901
H  5.1189507 7.99594269 8.89466569
H  8.2279373 7.47042099 12.51215041
H  8.28555524 8.71539141 11.24262605
O  6.41108719 8.22866741 11.99698637
H  6.13790059 9.59881859 10.45769432
H  4.67059482 8.9317863 11.21118832
