program: Gaussian 09
title: 000052927
version: EM64L-G09RevD.01
frameworkgroup: C1[X(C21H22ClN2O3)]
method: RPBEPBE
basis: SDD
operation: Freq
keyword: #p
keyword: freq=noraman
keyword: PBEPBE/SDD
title: #p freq=noraman PBEPBE/SDD
converged: YES YES NO NO
title: Mulliken charges:
elementType: Cl O O O N N C C C C C C C C C C C C C C C C C C C C C H H H H H H H H H H H H H H H H H H H H H H
charge: 0.014549 -0.176464 -0.296119 -0.249404 -0.150982 -0.417683 -0.189620 -0.419917 0.259115 -0.592991 0.138000 0.448235 -0.363081 0.220825 0.080149 0.322925 -0.455149 -0.585857 -0.660365 -0.314522 0.179737 0.224337 -0.395984 -0.175354 -0.188481 -0.524562 -0.527017 0.252387 0.282148 0.254697 0.270035 0.254621 0.239156 0.227099 0.296906 0.354304 0.284722 0.233333 0.226094 0.241430 0.306762 0.265471 0.284086 0.242779 0.233566 0.260299 0.250905 0.256061 0.278819
chargesum: 1.00000
title: Mulliken charges with hydrogens summed into heavy atoms:
elementType: Cl O O O N N C C C C C C C C C C C C C C C C C C C C C
charge: 0.014549 -0.176464 -0.296119 -0.249404 -0.150982 -0.063379 0.062767 0.116928 0.259115 -0.068335 0.138000 0.448235 0.103175 0.220825 0.080149 0.322925 -0.158243 -0.301135 0.040492 -0.007760 0.179737 0.224337 -0.130512 -0.175354 0.095605 0.212082 0.258768
polarizability: 4.06774818e+02 -1.00422770e+01 3.05931877e+02 2.10022973e+01 5.51493832e+00 1.75820856e+02
1716.lowfreq: -7.8657 -2.6885 -0.0007 0.0008 0.0017 5.3878 12.7697 29.8085 39.0710
frequency: 11.5924 29.7869 39.0357 49.4641 59.5335 70.7836 74.8119 92.0379 92.7528 111.5026 128.8015 137.8013 148.3202 158.4263 168.9070 186.7780 199.1132 228.7329 243.5685 243.7829 257.2201 262.4549 294.2061 307.5013 321.1373 342.9876 349.5410 378.7633 387.8462 412.3718 419.3112 438.7081 446.4850 475.7600 492.2008 499.0535 520.5492 561.4396 565.1675 577.0226 622.3774 637.1210 662.4890 667.3559 699.1319 701.4025 724.4888 731.6513 740.9790 751.7827 755.4178 768.5634 824.6476 841.7742 853.0664 869.7896 891.8296 898.3648 903.6856 919.0628 927.1654 932.3428 957.5880 967.3080 969.4215 1006.6382 1039.8487 1060.2441 1080.8289 1085.2751 1095.4847 1103.0548 1110.3084 1113.0973 1125.8692 1132.1858 1146.6915 1157.6789 1170.5642 1186.0289 1199.0268 1221.3072 1243.1269 1248.2719 1258.7138 1267.2652 1282.5428 1298.8036 1309.2954 1318.5550 1326.1456 1334.9766 1339.7176 1360.9476 1367.3347 1386.5861 1392.9460 1407.4420 1409.6938 1434.2746 1448.3058 1450.4527 1455.6847 1457.9070 1459.2405 1463.3172 1468.2511 1473.2585 1477.6384 1480.4660 1482.1124 1483.7411 1497.1043 1519.5770 1542.7963 1568.7075 1601.0129 1617.5010 1643.8228 2977.6476 2986.2171 2994.9418 2999.6932 3007.6956 3011.5361 3064.2927 3074.7387 3076.4796 3077.6340 3096.8780 3100.7364 3103.1388 3121.8741 3140.3361 3149.0088 3159.3962 3161.8693 3171.0158 3175.3272 3181.0430 3487.0337
redmass: 3.0704 4.9394 4.5765 6.4677 2.9630 1.6432 3.5576 3.5772 3.4677 2.5651 2.9988 3.6231 4.3839 1.1215 2.6445 4.1997 2.2082 4.8596 3.2006 2.2660 3.6367 3.3822 5.0083 9.9972 5.0756 4.1046 4.7326 4.3354 4.7735 5.8269 4.6143 5.0627 4.0777 4.7872 3.5762 4.7363 4.2371 3.6118 4.7562 5.6991 4.4058 3.4345 5.5756 3.1327 5.1213 5.4026 2.9086 2.8947 4.1636 3.0448 4.4797 2.3375 1.9182 1.7820 2.2502 3.8727 2.7589 1.9137 1.4425 2.3730 1.4975 3.8492 4.6827 1.4768 2.4338 2.4485 2.6828 2.4130 3.0704 2.1188 2.1143 2.4960 1.2383 1.3502 2.4598 1.9703 1.3367 1.7201 2.3389 1.5132 1.3894 2.0415 1.4239 1.4900 1.3322 1.5869 3.7135 1.5346 1.3581 2.3434 2.1223 1.7195 1.5426 1.9565 3.8674 2.2922 4.7279 1.4335 1.7328 1.2238 1.5580 1.2112 1.3308 1.2613 1.3356 1.0662 1.0702 1.0817 2.1496 1.0944 1.0536 1.1225 3.7505 4.2630 5.1282 6.9125 6.6902 7.0386 5.2985 1.0312 1.0686 1.0367 1.0649 1.0646 1.0301 1.0908 1.1056 1.0956 1.0942 1.1007 1.0994 1.0976 1.1032 1.1022 1.0908 1.1067 1.0928 1.0920 1.0923 1.0968 1.0760
irintensity: 1.5565 0.9271 0.2501 1.3653 0.1344 4.5579 2.8243 2.6995 2.7744 1.5682 5.0889 7.9620 3.0817 0.3545 0.7195 0.6708 1.6618 7.7200 1.3528 0.0722 2.8559 17.5353 1.0551 1.7570 0.0771 0.1888 8.5814 2.3471 5.4041 5.5680 6.6377 18.8682 0.7054 6.9732 5.7589 8.8828 11.2589 8.1900 13.3537 6.5724 32.9523 44.1677 6.2068 16.3002 15.4737 5.6901 26.2446 7.4507 15.3888 8.6244 3.4749 26.2445 25.2788 33.8619 13.3432 19.9149 27.0693 3.9359 15.9296 18.1633 8.5067 27.7615 85.6694 7.1364 38.2506 3.3299 11.7315 9.2124 4.2794 33.9701 19.7291 38.2445 14.8138 41.7091 22.9500 22.8644 0.3011 25.3384 40.6922 50.6640 2.1944 29.7792 51.5021 14.5561 65.4928 31.8788 181.2877 31.6591 20.1664 245.0230 92.3217 30.5264 42.1986 47.5103 154.1083 125.2646 22.5901 14.9605 14.8053 23.1056 23.6049 20.2927 8.6803 18.2548 29.0515 1.0502 21.9030 6.2629 145.6825 26.6235 17.8436 25.6646 43.4631 255.6470 61.9395 77.8377 21.3209 190.2674 439.0272 38.7273 6.9601 14.8353 8.2416 10.2752 57.3904 0.0355 22.5070 5.6129 0.9701 23.5371 15.5445 17.4799 13.1947 11.6776 1.9918 3.7418 0.1155 0.6699 0.3632 0.3109 60.1637
temp: 298.150 k
press: 1.00000 atm
elementType: 17 8 8 8 7 7 6 6 6 6 6 6 6 6 6 6 6 6 6 6 6 6 6 6 6 6 6 1 1 1 1 1 1 1 1 1 1 1 1 1 1 1 1 1 1 1 1 1 1
symmnumber: 1
zpe: 1022414.0 jmol-1
zpe.correction: 0.389417 hartree
zpe.thermalcorrener: 0.415079 hartree
zpe.thermalcorrenthalpy: 0.416023 hartree
zpe.thermalcorrgfe: 0.332150 hartree
zpe.sumelectzpe: -1606.487218 hartree
zpe.sumelectthermal: -1606.461556 hartree
zpe.sumelectthermalent: -1606.460612 hartree
zpe.sumelectthermalfe: -1606.544486 hartree
dipole: -1.1925 -1.6316 -1.1183
dipole: 2.3097
quadrupole: -101.6082 -132.6026 -156.8774
quadrupole: 8.8455 -5.4511 14.6640
quadrupole: 28.7545 -2.2399 -26.5147 8.8455 -5.4511 14.6640
hfenergy: -1606.8766354 hartree
pointgroup: C01 [X(C21H22Cl1N2O3)]
dipole: 0.5049284 -0.6319887 0.4140044 debye
polarizability: 406.318253|13.9655165|307.204635|17.7390319|-1.1171397|175.0046637 unknown
InChI: InChI=1S/C21H22ClN2O3/c1-4-17-21(25)23-16-6-5-13(22)10-15(16)20-14-11-19(27-3)18(26-2)9-12(14)7-8-24(17)20/h5-6,9-11,17,23H,4,7-8H2,1-3H3
charge 1 multiplicity 1
49 atoms
Cl -0.521961 4.518506 1.373298
O  -3.969735 -2.207943 -1.840465
O  3.823053 1.394676 -1.028764
O  5.124248 -1.031433 0.154655
N  -1.264867 -1.724144 0.274699
N  -2.992768 -0.119724 -1.615517
C  -2.762366 -1.793391 0.249547
C  -0.543117 -3.03833 0.386096
C  -0.552312 -0.58163 0.115491
C  0.708234 -2.891382 1.261594
C  0.910511 -0.64987 0.117818
C  1.575424 -1.788547 0.690257
C  -3.464142 -1.073866 1.43847
C  -1.232616 0.723665 -0.052673
C  -3.290026 -1.405938 -1.15252
C  -2.356329 0.934178 -0.915917
C  1.707425 0.388723 -0.451829
C  2.9709 -1.851375 0.691772
C  -4.981688 -1.362202 1.44868
C  -0.695883 1.844377 0.648973
C  3.107705 0.328174 -0.449345
C  3.764483 -0.826449 0.10053
C  -2.841775 2.252636 -1.123421
C  -1.220643 3.128081 0.45388
C  -2.280534 3.352283 -0.453353
C  4.432963 2.331226 -0.044423
C  6.02267 -0.629791 -0.969309
H  -3.016274 -2.863107 0.328795
H  -0.273624 -3.374879 -0.634476
H  -1.243172 -3.769304 0.81813
H  1.24778 -3.853084 1.284161
H  0.416288 -2.658976 2.305336
H  -3.289044 0.014134 1.416711
H  -3.004465 -1.456318 2.370098
H  1.251608 1.260014 -0.929565
H  -3.45624 0.113512 -2.501887
H  3.497633 -2.713333 1.112902
H  -5.482817 -0.973993 0.54434
H  -5.191205 -2.445225 1.508001
H  -5.44888 -0.879475 2.323814
H  0.125175 1.694929 1.35459
H  -3.687232 2.41247 -1.801223
H  -2.672023 4.360547 -0.614396
H  5.146049 1.804694 0.617014
H  3.643152 2.813073 0.560251
H  4.957834 3.084695 -0.648439
H  5.995845 -1.435685 -1.722289
H  7.022942 -0.564257 -0.519735
H  5.711315 0.324262 -1.418557
