program: Gaussian 16
title: TEXT
version: ES64L-G16RevA.03
method: RB3LYP
basis: TZVP
operation: Freq
keyword: #P
keyword: Geom=AllCheck
keyword: Guess=TCheck
keyword: SCRF=Check
keyword: GenChk
keyword: RB3LYP/TZVP
keyword: Freq
converged: YES YES NO YES
title: Mulliken charges:
elementType: Ni S P P C C H C H H C H C H H C C H C H C H C H H C H C H H C H H C H C H H C H C H H C H H C H H C H H C H H C H H C H H C H H C H H C H H C H H C H H C H H C H H C H H C H H C H H C H H C H H H H
charge: -0.105270 -0.074930 0.347730 0.379343 -0.068488 -0.255236 0.148000 -0.408088 0.154350 0.157757 -0.234903 0.167713 -0.260307 0.110140 0.136805 -0.177487 -0.185653 0.155200 -0.112661 0.108206 -0.202693 0.158880 -0.426477 0.162428 0.155756 -0.111472 0.122640 -0.265507 0.141859 0.120088 -0.239818 0.114891 0.126067 -0.262532 0.176572 -0.269112 0.117603 0.152549 -0.076670 0.110656 -0.239655 0.123091 0.138013 -0.286264 0.125781 0.139717 -0.229897 0.127090 0.108402 -0.253290 0.144768 0.118816 -0.224122 0.130090 0.103568 -0.222989 0.100516 0.127902 -0.228768 0.118849 0.128642 -0.287203 0.127018 0.154282 -0.234034 0.109185 0.127427 -0.279414 0.148372 0.140846 -0.233279 0.130459 0.110295 -0.232359 0.105053 0.127304 -0.230608 0.103268 0.128867 -0.231830 0.124465 0.101231 -0.241753 0.102714 0.124956 -0.226015 0.112939 0.125956 -0.228959 0.111471 0.127119 -0.189501 0.114636 0.127503 -0.387025 0.112110 0.130302 0.121767 0.114249
chargesum: -0.00000
title: Mulliken charges with hydrogens summed into heavy atoms:
elementType: Ni S P P C C C C C C C C C C C C C C C C C C C C C C C C C C C C C C C C C C C
charge: -0.105270 -0.074930 0.347730 0.379343 -0.068488 -0.107237 -0.095982 -0.067191 -0.013361 -0.063238 -0.030453 -0.004455 -0.043813 -0.108294 0.011168 -0.003560 0.001139 -0.085960 0.001040 0.033986 0.021450 -0.020765 0.005596 0.010294 0.009536 0.005429 0.018723 -0.005902 0.002578 0.009804 0.007475 -0.000002 0.001528 -0.006135 -0.014083 0.012879 0.009631 0.052639 -0.022846
polarizability: 5.58165872e+02 1.71590444e+01 6.11470740e+02 -4.49404007e+01 -2.65749494e+01 6.65679774e+02
1716.lowfreq: -225.8474 -6.6751 -5.6926 -0.0017 0.0020 0.0029 3.7828 16.2703 22.2003
redmass: 9.3007 4.3584 4.2331 4.0567 4.3996 3.3049 3.4781 3.5516 4.0898 3.0234 4.0296 3.4074 2.9577 3.5388 4.4902 4.7568 3.4812 2.1637 2.6054 3.7977 3.3769 3.3647 4.4437 3.2384 3.9805 4.2054 3.7967 3.4573 4.9014 3.2321 4.1566 3.5388 2.6463 1.8922 2.3126 2.0387 1.6706 1.6870 2.9933 2.6360 2.8439 2.9137 4.3603 2.4372 1.9432 2.4054 2.0772 3.2691 3.4259 4.2439 4.0688 4.2386 3.7964 3.0734 2.4478 2.8891 2.7075 2.9833 2.9363 3.0292 3.0253 2.9298 2.6917 2.6879 1.6859 1.7015 1.8201 2.1956 6.4900 4.1776 2.6148 5.7706 3.5721 1.4571 3.4276 2.4706 2.6231 2.7945 2.6951 1.0868 1.9063 1.4756 1.4765 1.4749 1.4857 1.8694 1.8252 3.2501 3.3117 3.3230 1.3571 1.6739 1.8238 1.7796 1.7686 1.9288 1.2109 2.0774 2.0246 2.1253 2.1444 2.0370 2.2030 2.0291 1.9585 2.0362 1.4168 1.3957 1.4691 1.5014 1.7780 2.1348 1.3510 2.9261 6.4646 2.0774 2.0560 2.0816 2.0811 2.7574 1.9509 1.9711 1.9980 2.1829 1.9463 1.9170 1.8608 1.1890 1.6870 1.6862 2.9400 2.9745 2.9940 2.9810 1.7628 1.0769 1.0755 1.1038 1.4965 1.2915 1.1147 1.6795 1.7610 1.9718 1.7936 1.4015 1.1032 1.2750 1.2770 1.3332 1.3322 1.1818 1.5118 1.4645 1.3794 1.3650 1.3797 1.2419 1.3451 1.2866 1.2873 1.5909 2.0352 1.2751 1.2495 1.2447 1.2361 1.2422 1.2509 1.2496 1.2296 1.2398 1.2075 1.1103 1.2143 1.2144 1.2074 1.2018 1.7446 1.3334 1.3360 1.3535 1.3530 1.3155 1.3848 1.3104 1.3033 1.2930 1.3916 1.4141 1.4308 1.4221 1.4451 1.4059 1.4669 1.4408 1.4096 1.4052 1.3956 1.3988 1.2283 2.1191 1.0782 1.0958 1.1730 1.1957 1.0908 1.1488 1.1418 1.1107 1.1301 1.0947 1.1329 1.0884 1.0891 1.0921 1.0957 1.0863 1.0841 1.0672 1.0851 1.0858 1.0522 1.0791 1.0954 1.0887 1.0929 1.0934 1.0916 4.1707 4.7970 1.0802 1.0663 1.0700 1.0694 1.0708 1.0688 1.0692 1.0655 1.0651 1.0749 1.0708 1.0632 1.0649 1.0661 1.0733 1.0639 1.0627 1.0631 1.0641 1.0677 1.0363 1.0700 1.0725 1.0586 1.0633 1.0620 1.0739 1.0619 1.0897 1.0965 1.0954 1.0948 1.0909 1.0840 1.0905 1.0914 1.0699 1.1008 1.0999 1.0960 1.1012 1.1002 1.0996 1.0988 1.0992 1.1003 1.1021 1.0990 1.0971 1.1031 1.1029 1.1014 1.1011 1.1061 1.1010 1.0855 1.0879 1.0896 1.0941 1.0916
irintensity: 172.9032 0.0504 0.4631 0.0829 0.3182 0.2186 0.3521 0.2500 0.0419 0.2336 0.5508 0.0700 0.0863 0.0789 1.0387 2.1216 0.3195 1.1459 0.1741 0.8493 0.3953 0.9938 0.6225 0.4353 0.3659 4.5153 1.1028 2.0703 0.4084 2.8774 5.4460 3.7619 0.6789 0.0991 0.4077 0.1314 0.8056 0.6664 1.4485 1.1344 3.2101 4.9684 23.7539 2.4750 0.0239 3.7876 1.3787 1.0605 10.8122 3.5396 8.5526 6.4126 24.7095 1.3826 1.6361 19.2314 5.7303 5.8954 2.7496 0.3336 0.7718 0.8417 7.7231 16.4833 11.5767 8.3226 7.7602 28.6339 10.5527 42.0025 49.4397 40.6007 0.3909 216.1425 37.9340 2.7205 16.3291 12.0844 6.9864 6.5118 33.9043 0.2153 0.9511 0.0609 0.7501 1.0148 1.3330 1.1433 3.9893 0.5263 29.6647 14.5678 5.2104 2.2348 12.5600 14.9010 1.3998 6.2685 4.2590 2.5953 7.6661 1.3932 5.6479 0.1340 5.8841 9.8519 4.3856 6.4781 3.5112 3.0317 59.5298 86.3728 8.6649 0.0489 21.0991 1.7157 1.4163 3.1127 32.2823 0.4328 1.5919 5.0206 0.7796 2.0801 0.1698 0.9491 1.6087 3.7533 5.7386 1.9152 0.3183 0.4632 0.7747 0.3799 6.1822 0.8034 1.1516 0.2822 3.6929 2.5202 5.6042 14.9537 3.3859 0.7167 12.9399 10.2522 2.9199 1.7994 4.2521 12.7525 8.7223 14.2935 9.7841 11.6059 0.6462 3.9333 0.3676 25.2686 0.1998 0.2325 0.2098 4.8847 12.6827 1.1057 4.7618 1.8629 3.4937 2.8131 4.4554 2.8417 0.6613 0.2551 2.5215 1.2400 2.4877 1.8212 2.2283 4.6488 2.7593 0.6828 1.5073 0.8101 0.5797 0.5095 3.9428 1.3252 0.2832 0.2757 1.5882 3.2498 0.7067 2.0105 1.0045 0.7774 0.8005 0.4858 0.8231 0.6628 0.0843 0.3772 4.2265 1.2141 4.7614 7.6806 23.9241 23.5873 1.6758 7.8382 16.3451 3.9371 14.7215 6.1850 4.6607 5.2705 1.7099 20.8492 20.9108 2.8578 2.6305 6.7104 8.2380 10.1718 5.2366 6.1208 0.6393 3.0450 5.2426 0.8035 1.0615 10.9912 185.7594 7.5966 24.4458 28.9894 83.3124 33.1631 32.2231 23.4409 60.7072 16.2424 4.9339 32.5135 3.2248 41.8678 19.1616 18.6110 0.7137 21.2610 0.4216 1.2200 61.3631 25.0545 16.5109 52.1018 7.2004 13.0383 53.2917 41.7487 22.4197 39.8296 133.3788 107.7339 45.5962 99.0233 43.5021 134.3536 80.0454 32.2155 59.8030 53.7011 83.4098 44.0459 22.3995 46.9206 103.9338 23.0204 25.4729 26.4682 72.1368 54.5358 35.6224 29.2470 1.0175 44.8682 40.2923 26.3343 17.0434 20.2741 10.3479 24.6979 12.2745
temp: 298.150 k
press: 1.00000 atm
elementType: 28 16 15 15 6 6 1 6 1 1 6 1 6 1 1 6 6 1 6 1 6 1 6 1 1 6 1 6 1 1 6 1 1 6 1 6 1 1 6 1 6 1 1 6 1 1 6 1 1 6 1 1 6 1 1 6 1 1 6 1 1 6 1 1 6 1 1 6 1 1 6 1 1 6 1 1 6 1 1 6 1 1 6 1 1 6 1 1 6 1 1 6 1 1 6 1 1 1 1
symmnumber: 1
zpe: 2335613.3 jmol-1
zpe.correction: 0.889588 hartree
zpe.thermalcorrener: 0.932450 hartree
zpe.thermalcorrenthalpy: 0.933394 hartree
zpe.thermalcorrgfe: 0.812720 hartree
zpe.sumelectzpe: -3959.006548 hartree
zpe.sumelectthermal: -3958.963687 hartree
zpe.sumelectthermalent: -3958.962742 hartree
zpe.sumelectthermalfe: -3959.083417 hartree
dipole: -5.1379 -1.0338 1.4918
dipole: 5.4490
quadrupole: -299.4479 -295.0525 -260.2825
quadrupole: -75.8167 -23.1822 19.1359
quadrupole: -14.5202 -10.1249 24.6451 -75.8167 -23.1822 19.1359
hfenergy: -3959.8961365 hartree
pointgroup: C01 [X(C35H60Ni1P2S1)]
dipole: -2.0213907 -0.4067293 0.5869128 debye
polarizability: 558.165872|17.1590444|611.4707403|-44.9404007|-26.5749494|665.6797737 unknown
InChI: InChI=1/35C.Ni.2P.S.60H
charge 0 multiplicity 1
99 atoms
Ni 1.84065231 14.19580418 5.12609638
S  3.76896329 14.53303101 6.22257754
P  0.76645367 12.28837069 5.605608
P  -0.06480816 15.21411846 4.62490982
C  3.41304733 15.14145438 4.27076773
C  3.82134648 14.17454288 3.31369596
H  3.86892575 13.12968741 3.59580276
C  -1.07315136 12.6959264 5.56150895
H  -1.6545178 11.81328639 5.28414901
H  -1.35191456 12.9519881 6.58475387
C  0.99528074 11.47239314 7.27810014
H  2.03161401 11.11822868 7.24314255
C  0.92338755 12.52911584 8.39287858
H  -0.08456408 12.95619331 8.43258147
H  1.60468671 13.34924562 8.15905347
C  4.22256589 15.89253585 1.65919596
C  0.93118236 10.87401342 4.3783713
H  0.16908349 10.12381945 4.61623572
C  3.92114577 16.86060879 2.6236951
H  3.96550372 17.91247706 2.36161565
C  -0.42034204 16.04747767 2.97557964
H  -1.50750475 16.05087795 2.83061589
C  -1.3914094 13.87119 4.62346999
H  -2.37111849 14.29423187 4.85358193
H  -1.43917782 13.52095757 3.59166715
C  3.53143815 16.50282518 3.90262607
H  3.26711136 17.27822993 4.60775592
C  0.08777741 17.49700191 2.92410406
H  -0.41189723 18.10925979 3.67747958
H  1.15508601 17.50672062 3.15970169
C  1.25337955 11.91989403 9.7589967
H  2.2986195 11.58988643 9.76073008
H  1.16433696 12.68272038 10.53822288
C  -0.65478456 16.45549514 5.91115323
H  0.01994422 17.30510989 5.75571227
C  -0.39405279 15.92572328 7.329792
H  -1.03693275 15.05902194 7.51702988
H  0.63507386 15.56934798 7.40817649
C  4.17069279 14.54983532 2.02148119
H  4.43446274 13.78263481 1.30134285
C  0.08212714 10.27897949 7.58838855
H  -0.96282104 10.60855148 7.57925486
H  0.17656701 9.50943316 6.81828433
C  2.32122677 10.22691185 4.48979017
H  3.08360133 11.00704073 4.38580007
H  2.45872879 9.78719368 5.48038744
C  0.40536191 9.67501661 8.96223773
H  -0.28290554 8.85254535 9.17896402
H  1.4123359 9.24244862 8.9325184
C  -2.09842255 16.95893774 5.78372873
H  -2.28889651 17.35432928 4.78335425
H  -2.79042752 16.12280069 5.92875167
C  2.54783647 9.15463175 3.4180834
H  3.56071959 8.75200309 3.51031787
H  1.85998915 8.31838501 3.59178774
C  0.34385051 10.72809834 10.07293368
H  -0.68923401 11.08242361 10.17483428
H  0.617893 10.28143595 11.03304831
C  0.2282291 15.21428542 1.85411621
H  1.3014656 15.13894329 2.0496036
H  -0.15915336 14.19249065 1.86095439
C  0.68042814 11.39413645 2.95227789
H  -0.34102817 11.77069889 2.86415794
H  1.34464796 12.24490853 2.76641432
C  -2.39882972 18.03516736 6.83715081
H  -1.77671503 18.91513419 6.63559739
H  -3.43966037 18.3611338 6.7511163
C  3.59513956 16.19355024 7.02417275
H  4.45754994 16.8066481 6.75041359
H  2.69508023 16.66048523 6.62475164
C  -0.68539495 16.99741306 8.38407712
H  -0.51621663 16.5930148 9.38638609
H  0.02202466 17.82500817 8.25669008
C  0.91896024 10.31643952 1.88948723
H  0.17150893 9.52182527 2.00191993
H  0.77338122 10.74606663 0.8939791
C  -2.1159287 17.530728 8.25605713
H  -2.82055795 16.72547941 8.49665911
H  -2.29189599 18.32836522 8.98347983
C  0.0070374 15.84155215 0.47410858
H  0.51130779 15.23902974 -0.28710048
H  -1.06280495 15.8267038 0.23188663
C  -0.12721928 18.12240328 1.53995622
H  -1.20365485 18.21005475 1.34789269
H  0.27615645 19.13953749 1.53040516
C  0.51652981 17.28392054 0.4330359
H  1.60302558 17.27991208 0.57066258
H  0.31942808 17.73141066 -0.54567737
C  2.31836235 9.71016199 2.01097858
H  3.06570631 10.48482595 1.80250789
H  2.46048575 8.92480239 1.26308222
C  3.48423495 16.0639963 8.53946403
H  2.61900332 15.44339411 8.78720498
H  4.36285182 15.54344835 8.93129591
C  3.35005583 17.42960896 9.21420662
H  2.46190346 17.95926813 8.85921279
H  3.26242725 17.32563081 10.29847235
H  4.21856879 18.06142856 9.00935585
H  4.5175792 16.1849546 0.65928879
