program: Gaussian 09
title: 000052808
version: EM64L-G09RevD.01
frameworkgroup: C1[X(C12H17NO3)]
method: RPBEPBE
basis: SDD
operation: Freq
keyword: #p
keyword: freq=noraman
keyword: PBEPBE/SDD
title: #p freq=noraman PBEPBE/SDD
converged: YES YES NO NO
title: Mulliken charges:
elementType: O O O N C C C C C C C C C C C C H H H H H H H H H H H H H H H H H
charge: -0.288336 -0.284180 -0.274559 -0.605573 -0.239654 0.545325 -0.490776 -0.706365 -0.594256 -0.430977 0.216938 -0.349784 0.179350 0.206590 -0.518090 -0.535905 0.222935 0.237502 0.230207 0.219379 0.232017 0.213479 0.274297 0.230887 0.239495 0.324805 0.349220 0.208144 0.231399 0.260473 0.245529 0.228192 0.222290
chargesum: 0.00000
title: Mulliken charges with hydrogens summed into heavy atoms:
elementType: O O O N C C C C C C C C C C C C
charge: -0.288336 -0.284180 -0.274559 0.068452 -0.016719 0.545325 -0.023067 -0.041489 -0.319959 -0.200089 0.216938 -0.110290 0.179350 0.206590 0.181926 0.160105
polarizability: 2.01737098e+02 -1.15470668e+01 1.36517258e+02 9.92618739e+00 1.03133214e+01 1.14316703e+02
1716.lowfreq: -8.2425 -0.0007 -0.0001 0.0005 8.0302 11.7864 23.9727 34.1958 45.5808
frequency: 23.7799 34.1906 45.4871 65.9728 85.8789 117.3813 138.8906 150.6052 162.1002 192.9656 211.7457 238.9941 242.6372 255.2850 268.8534 310.8135 334.2386 355.5244 400.4723 451.1659 457.6529 484.4484 519.2234 546.9083 566.2484 581.4900 597.6314 647.5083 675.6171 684.7491 712.1523 736.4115 804.4664 836.7504 854.9802 896.4321 907.1758 928.1438 935.3081 981.2289 990.3684 1015.0672 1062.9780 1081.9023 1096.5333 1111.4019 1111.6519 1119.2071 1147.9226 1155.9870 1177.5270 1188.0304 1207.7846 1254.2547 1267.3021 1283.6744 1318.8777 1320.6357 1355.7858 1379.7206 1385.8113 1406.3161 1432.8705 1443.4702 1447.1061 1455.7608 1467.6859 1470.8753 1474.0239 1477.6284 1480.1587 1497.6285 1576.8023 1583.2572 1611.2257 1634.9419 2963.3393 2976.3218 2976.5704 2983.4349 2996.6917 3053.8074 3065.6399 3074.2207 3082.7933 3087.9258 3125.4844 3130.9990 3131.2427 3141.3261 3160.3975 3480.7300 3644.9402
redmass: 4.8133 5.6394 4.6424 2.3202 3.4051 3.2004 1.8344 3.2707 2.4584 2.2018 2.8054 1.2236 1.8635 3.6392 1.6468 3.3703 4.2266 4.1321 4.0029 3.4364 2.7439 3.0641 3.4389 3.0113 2.0118 1.1907 4.0744 2.6939 2.0979 4.0865 5.3917 3.5553 1.4751 3.4354 4.6034 1.5042 1.6900 1.3610 2.3094 6.1568 4.6832 1.8839 2.0396 2.0716 2.2238 1.2402 1.2566 2.0661 1.4715 1.4002 1.5687 1.2119 1.9210 2.8811 1.5732 1.4627 1.8009 1.4615 3.5753 4.8622 1.2408 1.8952 1.2172 1.3534 1.0857 1.0677 1.0505 1.0513 1.1233 1.0615 1.0556 2.3947 5.8724 1.5883 6.4276 3.2748 1.0326 1.0353 1.0355 1.0731 1.0754 1.1042 1.0962 1.0994 1.1002 1.0958 1.0994 1.0966 1.0966 1.0912 1.0945 1.0463 1.1034
irintensity: 2.3051 5.9617 1.4162 5.1732 8.9978 3.2625 0.2641 2.7476 0.7346 1.7197 1.7667 0.3369 2.8112 3.6784 2.6758 6.4849 4.6625 1.8820 2.3805 4.4326 8.9854 7.6455 9.9572 6.5422 22.8842 149.9862 2.7627 33.4417 25.4447 6.4572 12.9655 4.8603 35.6122 3.5897 2.4858 8.5536 10.1651 1.5141 9.5049 59.1229 45.6415 4.2234 31.0323 3.5152 35.6455 6.4645 0.1881 54.8023 4.2720 8.9904 12.7178 7.3004 52.9697 203.2032 13.0435 41.9905 15.6480 9.3548 90.6102 21.8868 8.3084 20.9712 0.2609 26.9023 6.6929 14.8774 13.9622 13.4643 69.8455 13.7740 28.9838 125.2367 29.9797 129.2827 10.5502 291.9432 64.7048 88.3382 24.0121 3.3354 24.3466 43.1607 4.6996 56.2397 33.2381 40.6315 26.1447 14.0269 7.7998 4.5883 11.0821 98.9838 91.5045
temp: 298.150 k
press: 1.00000 atm
elementType: 8 8 8 7 6 6 6 6 6 6 6 6 6 6 6 6 1 1 1 1 1 1 1 1 1 1 1 1 1 1 1 1 1
symmnumber: 1
zpe: 711835.2 jmol-1
zpe.correction: 0.271124 hartree
zpe.thermalcorrener: 0.288441 hartree
zpe.thermalcorrenthalpy: 0.289385 hartree
zpe.thermalcorrgfe: 0.224862 hartree
zpe.sumelectzpe: -746.660673 hartree
zpe.sumelectthermal: -746.643357 hartree
zpe.sumelectthermalent: -746.642412 hartree
zpe.sumelectthermalfe: -746.706936 hartree
dipole: -5.6211 -1.6908 -0.9934
dipole: 5.9533
quadrupole: -111.9402 -85.8016 -97.5928
quadrupole: -5.3735 19.1446 3.0117
quadrupole: -13.4954 12.6433 0.8521 -5.3735 19.1446 3.0117
hfenergy: -746.9317972 hartree
pointgroup: C01 [X(C12H17N1O3)]
dipole: 2.270236 0.377647 -0.4351963 debye
polarizability: 198.1406346|-19.4949607|138.465603|-10.1267835|-10.818956|115.964822 unknown
InChI: InChI=1S/C12H17NO3/c1-8(6-12(13)14)9-4-5-10(15-2)11(7-9)16-3/h4-5,7-8H,6,13H2,1-3H3
charge 0 multiplicity 1
33 atoms
O  1.946719 -1.710485 1.444134
O  3.232372 -0.076722 -0.536472
O  -4.884648 -0.707175 -1.258454
N  -2.699229 -1.422879 -0.977331
C  -2.292517 0.795023 1.008959
C  -0.85307 0.556237 0.536615
C  -3.34394 0.835374 -0.14105
C  -2.372409 2.115173 1.826072
C  -0.072768 -0.480723 1.105885
C  -0.246634 1.375311 -0.447365
C  1.273195 -0.703504 0.73574
C  1.096021 1.173116 -0.832201
C  -3.710906 -0.490499 -0.828522
C  1.875224 0.148976 -0.241476
C  2.794874 -2.663274 0.698252
C  3.88173 0.840501 -1.477326
H  -2.569156 -0.035014 1.689392
H  -4.298233 1.23368 0.246387
H  -3.013302 1.541614 -0.929166
H  -3.382862 2.249715 2.253993
H  -1.641293 2.110758 2.653816
H  -2.153023 2.990471 1.186541
H  -0.492266 -1.140856 1.873591
H  -0.81601 2.184946 -0.917561
H  1.538486 1.830284 -1.586871
H  -2.923621 -2.301226 -1.444517
H  -1.748301 -1.247968 -0.648764
H  2.200696 -3.18343 -0.078172
H  3.131785 -3.386768 1.456119
H  3.652515 -2.152552 0.233663
H  4.928088 0.505135 -1.526528
H  3.840728 1.884025 -1.110586
H  3.422755 0.779537 -2.483198
