program: Gaussian 16
title: NMR project
version: ES64L-G16RevC.01
method: RB3LYP
basis: 6-31+G(d,p)
operation: Freq
keyword: #N
keyword: Geom=AllCheck
keyword: Guess=TCheck
keyword: SCRF=Check
keyword: GenChk
keyword: RB3LYP/6-31+G(d,p)
keyword: Freq
converged: YES YES NO YES
title: Mulliken charges:
elementType: C C C C C C H H H H O C H H H C C H C H C O C C C C H C H C H O O C H H H C H H H C H C C C O C H H H C H H C H H C O C C C C H C H C H H O C H H C C C C H C H C H H O C H H H H
charge: 0.222732 -0.225233 0.226830 -0.129146 -0.017114 -0.143071 0.115924 0.107071 0.122323 0.128853 -0.341742 -0.145782 0.142841 0.148621 0.144125 -0.233593 0.193385 0.131983 0.478884 0.129922 -0.644188 -0.234212 0.813613 -0.515913 -0.492837 -0.265935 0.114686 -0.342017 0.117946 0.240187 0.125804 -0.321877 -0.328081 -0.142077 0.145221 0.146505 0.144022 -0.112697 0.148359 0.145471 0.145952 -0.478221 0.134873 0.440726 -0.625088 0.870591 -0.323895 -0.131241 0.142430 0.162967 0.127854 -0.488526 0.173300 0.139391 -0.518944 0.150394 0.141759 0.011554 -0.250901 0.727463 -0.305975 -0.184193 -0.120120 0.130478 -0.126382 0.115676 -0.400817 0.120365 0.130101 -0.272286 -0.121194 0.158124 0.129876 0.260199 -0.008130 -0.544003 -0.054105 0.133592 0.443250 0.109214 -0.282132 0.133555 0.118087 -0.353033 -0.138114 0.143292 0.144701 0.150428 0.137315
chargesum: -0.00000
title: Mulliken charges with hydrogens summed into heavy atoms:
elementType: C C C C C C O C C C C C O C C C C C C O O C C C C C C O C C C C O C C C C C C O C C C C C C C O C
charge: 0.338656 -0.118162 0.226830 -0.006823 0.111739 -0.143071 -0.341742 0.289804 -0.101610 0.323307 0.478884 -0.644188 -0.234212 0.813613 -0.401227 -0.374891 -0.265935 -0.342017 0.365991 -0.321877 -0.328081 0.293672 0.327085 -0.343348 0.440726 -0.625088 0.870591 -0.323895 0.302011 -0.175835 -0.226791 0.148869 -0.250901 0.727463 -0.175497 -0.068517 0.000245 0.003719 -0.400817 -0.272286 0.166806 0.260199 0.125462 -0.434790 0.079450 0.561337 -0.282132 -0.353033 0.300306
chargesum: 0.00000
1716.lowfreq: -1.3326 -0.1537 -0.0011 -0.0006 0.0008 1.9059 4.4992 7.3011 14.2805
frequency: 4.4908 7.2943 14.2799 16.5281 19.5555 22.3012 27.7645 30.6011 34.7016 39.5199 46.4718 50.8043 73.8262 79.9838 85.5915 87.3698 92.7961 102.7802 107.2461 121.5164 136.0651 141.3252 143.5518 150.4712 164.4057 175.5438 181.6821 187.1041 192.0149 195.7083 209.7130 216.4241 223.5922 233.3058 238.3135 243.3132 247.2122 270.1164 274.4090 275.4841 278.9436 291.7727 299.6502 305.3725 320.1473 324.4463 346.3496 356.4208 364.3308 369.6609 403.5322 420.5229 422.2271 423.0377 426.9589 433.8272 441.2264 458.8625 472.4045 475.6817 493.0214 513.1151 517.2734 520.2054 528.5765 542.1671 545.3190 550.2310 569.1833 579.9550 605.1609 611.1562 620.5896 626.5784 628.0951 635.4752 645.7256 650.4687 658.3751 661.9551 682.2104 696.0896 702.8888 709.3283 719.4378 724.3342 753.3408 754.5548 770.4607 787.6836 790.7416 810.8964 817.4304 818.9005 821.3509 827.0651 830.5968 839.8782 840.6259 845.9706 848.3829 851.0760 851.1919 858.4220 868.8195 872.0721 912.4877 923.9569 939.6840 944.2004 946.4803 948.7295 955.8108 965.7927 967.7766 975.8383 977.2411 990.1510 1002.8037 1006.1121 1018.3203 1020.7467 1024.2373 1028.3352 1031.8061 1041.5446 1049.4682 1066.9273 1068.2031 1082.7049 1086.9396 1095.9069 1114.4520 1136.0010 1137.3682 1139.3376 1147.7096 1169.4636 1170.9392 1171.9716 1172.1346 1172.4311 1172.6218 1179.5292 1185.3955 1189.6660 1197.7350 1199.2412 1201.9043 1205.6234 1205.8790 1206.1308 1210.0629 1211.3905 1217.7359 1224.5926 1233.1707 1239.1748 1248.0353 1251.5488 1262.1909 1269.3046 1282.1274 1284.9910 1296.7907 1303.9407 1318.4127 1325.7298 1328.5028 1332.7504 1333.9106 1336.9716 1341.7918 1345.3851 1351.4266 1358.1866 1359.3329 1373.2137 1382.7412 1388.8977 1396.3618 1405.7342 1414.7734 1450.6818 1456.2736 1456.9815 1463.3128 1468.7307 1479.8684 1479.9136 1481.6664 1482.4976 1488.9307 1490.9598 1494.4325 1496.5790 1496.7377 1497.5438 1497.6315 1497.7219 1499.7249 1502.0047 1502.6255 1509.0458 1509.6816 1511.3475 1513.2797 1515.7506 1546.7705 1551.0425 1552.8512 1623.8072 1625.4578 1625.4983 1633.5398 1639.0325 1649.1217 1659.8022 1661.4219 1663.0454 1664.4709 3011.3262 3014.3616 3015.7450 3017.0740 3020.6429 3022.1591 3031.3147 3031.8819 3041.8806 3057.3036 3076.7253 3078.8185 3079.5397 3080.5250 3084.4035 3084.9265 3097.0033 3099.9802 3102.1280 3144.1841 3149.0960 3149.1493 3149.2360 3151.4792 3166.9184 3167.4915 3168.8607 3194.0174 3202.5610 3203.4034 3206.0865 3211.1849 3214.4562 3221.4067 3221.7507 3223.1706 3227.6107 3232.8251 3233.4358 3236.3089
redmass: 5.9684 5.8692 4.9301 5.6185 4.9459 4.3079 3.9517 5.6007 5.1708 4.2001 3.7850 4.6292 3.6818 3.3262 3.5276 3.4015 3.4372 4.0806 4.6519 4.3278 2.9055 2.0590 2.1834 5.0257 4.6257 4.3606 4.0849 4.4053 3.8552 2.5730 1.5944 3.3515 2.1474 2.6062 1.7028 2.9588 1.4770 3.5414 1.8999 3.0951 1.9701 4.3556 3.7462 5.3028 4.0627 4.2612 3.9531 3.0431 3.3532 4.3626 4.3960 4.2878 3.1610 3.2228 3.7330 4.5567 5.0846 5.0890 5.0614 5.5958 4.8059 3.7887 4.1773 3.1608 3.5399 4.6698 3.5246 2.9712 5.1171 5.4358 4.5122 5.4692 4.8364 4.3969 4.7258 5.1103 6.8769 6.4514 6.3642 4.1776 3.8688 2.9636 3.2246 3.5267 3.6846 3.9335 4.7812 4.3716 3.9448 4.1605 3.3483 2.7721 1.5640 1.5273 1.5833 1.8622 2.2975 2.0205 1.6661 1.5328 2.5407 1.8644 2.1857 1.7977 3.5730 2.3679 2.5312 3.4726 1.3123 1.4033 2.7953 2.3240 2.1040 2.5825 1.5325 1.3601 1.3235 5.2009 4.9675 6.1433 4.1607 2.4894 3.0224 2.6371 2.0716 2.0903 4.0913 6.2107 6.0755 3.3239 3.1960 2.3687 4.7764 1.5540 1.3271 1.6144 1.9916 1.7699 1.2751 1.2734 1.2724 1.2725 1.2618 1.6854 1.5273 1.6522 1.1792 1.1752 1.2978 1.4021 1.4097 1.3886 1.4074 1.5893 1.5177 2.7449 1.9366 1.9836 2.4615 2.0623 2.1402 1.6818 3.8819 4.9596 1.8015 1.7646 1.5466 1.7307 2.4584 2.1225 1.4073 1.7263 1.8525 2.6340 3.1907 2.0849 2.3692 2.5569 1.4468 3.2517 2.1119 1.5330 2.4397 2.8338 2.7650 2.7337 2.3493 1.3629 1.1831 1.1854 1.3792 1.3236 1.1559 1.8265 1.1923 1.0520 1.1162 1.0534 1.0779 1.4657 1.6008 1.0975 1.8271 1.0567 1.0611 1.1521 1.1437 1.3875 2.5048 2.5023 2.5806 6.5799 6.5770 6.6044 9.0385 5.9708 6.5226 8.8173 5.8446 5.8586 6.0087 1.0850 1.0346 1.0344 1.0341 1.0338 1.0378 1.0721 1.0627 1.0662 1.0828 1.1062 1.1062 1.0855 1.1062 1.1018 1.1063 1.0977 1.0946 1.0965 1.1048 1.0996 1.1001 1.1004 1.0996 1.0894 1.0885 1.0894 1.0880 1.0889 1.0909 1.0930 1.0946 1.0884 1.0915 1.0913 1.0933 1.0923 1.0896 1.0926 1.0904
irintensity: 0.1002 0.1492 0.0636 0.0305 0.0725 0.4611 0.2993 0.2256 0.2444 1.0195 0.0267 0.4844 2.1480 3.7267 2.1710 3.6742 0.0718 4.1824 1.8483 4.1970 0.0786 1.6368 0.8866 0.1301 0.7597 1.6383 1.3433 0.0810 3.6242 1.2463 0.3047 0.3321 0.7120 3.0869 1.0471 3.2190 0.5085 0.7929 0.6396 0.1725 0.3658 6.8954 4.2846 1.4817 5.3379 1.7209 4.6111 3.1770 2.1159 0.7302 0.3353 1.0347 0.1747 2.4531 0.7433 3.7640 0.8768 0.2293 1.5810 4.0845 3.5327 6.3932 11.3681 11.7173 2.7302 7.8881 6.9098 19.3366 19.5779 5.4576 13.8352 8.6149 10.6797 0.0388 4.2391 9.9937 2.1425 1.1160 2.2473 1.6130 3.3795 4.9668 4.1199 4.8340 0.7738 3.1693 12.6538 6.4712 15.9691 15.0724 8.5909 8.2928 38.0591 5.9083 17.8521 15.4262 7.2249 25.8137 26.4149 40.7124 27.1361 12.6055 26.7886 9.3348 3.0114 31.8905 0.1384 10.5249 1.9753 5.6727 31.5277 9.1926 10.6387 34.0868 8.7466 0.7961 0.2636 14.4100 51.2202 2.4689 18.8684 4.9533 2.3481 0.6144 15.0370 16.8700 91.1296 40.6809 60.1633 32.4887 34.2990 39.3206 141.8098 158.2505 7.6775 125.2415 227.1531 85.8148 2.1068 0.3662 1.0496 0.8644 16.1025 23.5052 168.1853 104.8269 62.3012 27.1333 31.8925 16.2780 23.3548 9.7650 1.1211 26.2084 7.7470 5.1666 181.8384 41.3556 36.8971 208.6207 91.3322 2.5752 267.5484 315.6485 80.1505 13.5190 14.9348 5.6732 52.0977 103.9996 4.4918 0.2957 21.4914 23.8568 4.6147 47.2956 37.8291 31.0297 9.1592 96.1181 59.3680 19.1698 70.6060 11.6821 7.5374 3.7007 62.3154 42.7324 6.0023 5.8802 6.8191 8.8392 2.1659 103.4099 5.8159 14.9283 22.3492 4.5578 10.0890 101.9848 40.0078 6.6793 20.3523 33.4439 33.1443 15.9836 14.8700 8.1333 167.3963 91.8671 124.4485 35.4647 14.7134 2.6070 70.2689 186.9038 192.6161 341.6915 83.7190 76.1104 24.6962 30.6130 69.1252 57.6976 64.7897 42.4510 49.5534 15.9820 47.7976 19.7483 54.7223 39.0170 42.2020 11.1509 32.3322 19.5148 33.0819 37.4511 39.3419 16.0775 18.7996 20.5452 29.5134 25.1905 21.7155 12.8881 16.3023 12.5026 3.5409 5.9986 2.8456 10.0074 5.3066 2.5756 13.0970 8.4616 1.3141 0.3504 2.3764 6.6009 2.0665
temp: 298.150 k
press: 1.00000 atm
elementType: 6 6 6 6 6 6 1 1 1 1 8 6 1 1 1 6 6 1 6 1 6 8 6 6 6 6 1 6 1 6 1 8 8 6 1 1 1 6 1 1 1 6 1 6 6 6 8 6 1 1 1 6 1 1 6 1 1 6 8 6 6 6 6 1 6 1 6 1 1 8 6 1 1 6 6 6 6 1 6 1 6 1 1 8 6 1 1 1 1
symmnumber: 1
zpe: 1907062.8 jmol-1
zpe.correction: 0.726362 hartree
zpe.thermalcorrener: 0.770961 hartree
zpe.thermalcorrenthalpy: 0.771905 hartree
zpe.thermalcorrgfe: 0.640722 hartree
zpe.sumelectzpe: -2187.573817 hartree
zpe.sumelectthermal: -2187.529218 hartree
zpe.sumelectthermalent: -2187.528273 hartree
zpe.sumelectthermalfe: -2187.659457 hartree
dipole: 2.0365 -1.9854 0.4333
dipole: 2.8770
quadrupole: -270.8024 -266.6217 -273.2884
quadrupole: -11.3748 4.8309 24.5220
quadrupole: -0.5649 3.6158 -3.0509 -11.3748 4.8309 24.5220
hfenergy: -2188.3001786 hartree
pointgroup: C01 [X(C41H40O8)]
dipole: 0.8012139 -0.7811227 0.1704863 debye
polarizability: 618.7509583|-41.4715536|488.9413952|-19.0010287|27.0125692|433.9866115 unknown
InChI: InChI=1/41C.8O.40H
charge 0 multiplicity 1
89 atoms
C  5.80964454 -1.09552149 -2.55781134
C  4.50204321 -1.0529803 -2.06151374
C  3.88689816 0.15294478 -1.71779769
C  4.60806124 1.34247688 -1.90657123
C  5.9034335 1.32034841 -2.40967435
C  6.51646681 0.10008331 -2.73128185
H  6.25129227 -2.05231371 -2.80933821
H  3.95806354 -1.98779768 -1.94481622
H  4.14030454 2.29105782 -1.66900433
H  6.46142298 2.2386415 -2.56210508
O  7.79451847 0.18323719 -3.21320341
C  8.46981833 -1.01983193 -3.55493349
H  7.95000906 -1.55701973 -4.35854709
H  9.45832771 -0.71785014 -3.90350095
H  8.57687503 -1.68009757 -2.68484654
C  2.49407639 0.13647705 -1.14881345
C  2.31467648 -0.00138188 0.41572931
H  1.9359734 -0.69863898 -1.59547422
C  0.98659395 0.71633837 0.55955997
H  2.22863401 -1.06552031 0.65494336
C  0.77698208 1.49637168 -0.58224658
O  1.77591175 1.34988744 -1.51019488
C  3.45256069 0.57629641 1.24995903
C  4.38939474 -0.28662028 1.80929281
C  3.57818033 1.96638858 1.43715583
C  5.46558051 0.2260982 2.55514427
H  4.31200717 -1.36146813 1.68167061
C  4.65063087 2.46366223 2.17835394
H  2.83600511 2.62967127 1.01227462
C  5.60339548 1.59932199 2.74549235
H  6.41468354 2.03443896 3.31462268
O  6.32786929 -0.7069768 3.06122401
O  4.86893058 3.79308504 2.42052177
C  7.44479807 -0.25859844 3.81862886
H  7.98718092 -1.15901753 4.11007942
H  8.10110444 0.38495107 3.21956219
H  7.12661055 0.28220384 4.71885097
C  3.95763506 4.74201662 1.87836179
H  3.93405471 4.69391934 0.78285098
H  2.94392717 4.59360205 2.27036184
H  4.32775111 5.719486 2.19050933
C  -0.32917033 2.31173503 -0.75211053
H  -0.48514625 2.90344175 -1.64628585
C  0.0225037 0.73229095 1.56460931
C  -1.28497148 2.30828985 0.27756929
C  -1.13832476 1.52405458 1.43713408
O  0.14209746 -0.09239935 2.66829766
C  0.88946279 0.4409076 3.76977173
H  0.83866785 -0.30971178 4.56106379
H  1.93380811 0.61641125 3.49498271
H  0.44742505 1.37932677 4.1288908
C  -2.22550282 1.52559936 2.4870979
H  -2.88710703 0.66010518 2.34680263
H  -1.79675702 1.41930985 3.4870202
C  -3.03745782 2.81982685 2.39164174
H  -2.42267499 3.67264557 2.7057572
H  -3.91063193 2.78401839 3.0505911
C  -3.50062073 3.06470656 0.94797132
O  -2.37239681 3.1158965 0.05389713
C  -4.55104356 2.07068136 0.46693725
C  -4.29983765 1.12212952 -0.52536993
C  -5.83730533 2.10589303 1.03283384
C  -5.28672516 0.21854241 -0.94081053
H  -3.3228966 1.07781284 -0.9933837
C  -6.829451 1.22000634 0.62977965
H  -6.07449716 2.84503873 1.7950388
C  -6.55886286 0.26590343 -0.36333623
H  -5.04160594 -0.51770579 -1.69572638
H  -7.8244091 1.25597255 1.06190922
O  -7.6092118 -0.55010867 -0.6964879
C  -7.4670209 -1.49353901 -1.76383972
H  -8.50172117 -1.75251058 -2.01144511
H  -7.02733313 -1.0083842 -2.6450346
C  -6.68568991 -2.73731309 -1.39244954
C  -6.84958442 -3.34402602 -0.1359012
C  -5.8262572 -3.34221937 -2.31046883
C  -6.17241084 -4.51292606 0.1878188
H  -7.5063604 -2.88402129 0.59649733
C  -5.14201702 -4.52595695 -2.00560772
H  -5.67552367 -2.88985598 -3.28850782
C  -5.31463601 -5.11419785 -0.74772735
H  -6.29066611 -4.9806433 1.15994014
H  -4.48133327 -4.96283079 -2.74483621
O  -4.69636059 -6.26154839 -0.33545003
C  -3.80713749 -6.9142014 -1.23275809
H  -4.32413267 -7.23523358 -2.14599544
H  -2.96196678 -6.26712577 -1.49940714
H  -3.43713789 -7.79082989 -0.6997117
H  -3.92526516 4.07261174 0.87767266
