program: Gaussian 16
title: NMR project
version: ES64L-G16RevC.01
method: RB3LYP
basis: 6-31+G(d,p)
operation: Freq
keyword: #N
keyword: Geom=AllCheck
keyword: Guess=TCheck
keyword: SCRF=Check
keyword: GenChk
keyword: RB3LYP/6-31+G(d,p)
keyword: Freq
converged: YES YES NO YES
title: Mulliken charges:
elementType: C C C C C C H H H H O C H H H C C H C H C O C C C C H C H C H O O C H H H C H H H C H C C C O C H H H C H H C H H C O C C C C H C H C H H O C H H C C C C H C H C H H O C H H H H
charge: 0.067486 -0.239804 0.394646 -0.118555 0.053686 -0.067618 0.129756 0.109288 0.130153 0.115052 -0.343505 -0.152831 0.144550 0.148318 0.144477 -0.228372 0.167204 0.130717 0.383906 0.130146 -0.595057 -0.238883 0.827270 -0.516840 -0.283855 -0.388287 0.136676 -0.702247 0.099049 0.447848 0.125646 -0.325454 -0.318874 -0.118814 0.144587 0.147099 0.143842 -0.157896 0.145798 0.142901 0.151238 -0.374859 0.134977 0.351252 -0.497341 0.753441 -0.327588 -0.137491 0.139823 0.161793 0.129745 -0.509007 0.171254 0.138365 -0.519685 0.152113 0.140326 0.023900 -0.247292 0.695134 -0.319576 -0.154675 -0.127938 0.132232 -0.167259 0.115550 -0.338198 0.122642 0.129657 -0.278751 -0.147895 0.158567 0.132113 0.268628 -0.380920 -0.211263 0.392500 0.131044 -0.010639 0.112346 -0.245585 0.118175 0.133071 -0.354870 -0.129519 0.149494 0.146131 0.143880 0.137755
chargesum: -0.00000
title: Mulliken charges with hydrogens summed into heavy atoms:
elementType: C C C C C C O C C C C C O C C C C C C O O C C C C C C O C C C C O C C C C C C O C C C C C C C O C
charge: 0.197242 -0.130516 0.394646 0.011598 0.168738 -0.067618 -0.343505 0.284513 -0.097655 0.297350 0.383906 -0.595057 -0.238883 0.827270 -0.380164 -0.184807 -0.388287 -0.702247 0.573494 -0.325454 -0.318874 0.316715 0.282042 -0.239882 0.351252 -0.497341 0.753441 -0.327588 0.293869 -0.199388 -0.227247 0.161655 -0.247292 0.695134 -0.187344 -0.039125 -0.005296 -0.037602 -0.338198 -0.278751 0.142785 0.268628 -0.249876 -0.098917 0.510675 0.122432 -0.245585 -0.354870 0.309986
1716.lowfreq: -0.0012 0.0003 0.0014 0.7514 1.7069 2.5317 5.2472 7.4929 14.7475
frequency: 5.2364 7.4833 14.7443 15.9158 19.6134 24.3998 26.3777 31.0141 33.3026 41.7880 46.8009 50.4128 72.4247 79.1611 85.7330 86.7929 92.9790 103.9030 110.6791 121.2299 134.2201 137.7698 144.3026 147.3376 166.9787 168.2811 180.1163 190.5970 196.9105 200.1199 208.7314 216.9804 227.8927 237.1729 242.3577 247.4232 253.8400 271.0143 274.5842 278.8970 279.8458 289.8883 299.0521 303.1131 315.4169 323.8405 337.1118 351.2064 361.9704 371.8411 404.3958 421.9584 423.6232 424.2167 425.0092 430.6367 438.6382 455.2517 480.2476 487.0132 502.9859 513.8504 520.5172 523.3877 530.2863 541.5247 546.8602 547.6518 554.2688 575.6351 595.0006 596.2905 626.3670 627.6732 629.5313 641.3666 645.2477 653.9927 655.6499 661.5930 682.6516 696.7688 702.9580 708.5231 719.3665 725.7957 753.5892 758.0004 770.3885 789.7020 791.1198 813.3907 820.7486 822.1050 824.2727 826.5137 829.0841 835.9761 839.1722 843.0895 847.6538 848.0739 849.8079 858.8725 870.2555 881.4534 912.8042 925.2510 944.3364 948.5995 950.8716 954.3265 956.9747 966.1573 968.2927 970.2736 970.5601 987.2579 1002.8626 1006.5133 1016.7188 1023.3787 1024.8532 1028.1975 1032.7239 1041.8595 1051.4912 1067.4739 1067.6033 1084.2786 1088.1412 1096.4262 1114.0867 1136.6159 1137.4390 1138.9954 1147.8509 1170.2493 1171.8330 1172.2274 1172.2963 1172.5105 1172.6183 1179.4776 1185.6958 1189.2641 1196.0175 1198.5254 1201.8816 1205.5333 1205.9155 1206.2836 1209.9121 1211.6109 1216.5300 1222.5091 1232.6735 1236.4715 1248.1299 1251.5792 1262.7244 1269.3872 1285.1632 1286.6368 1297.7120 1300.6839 1318.6856 1322.6848 1328.5286 1332.5962 1333.8455 1336.7961 1342.5814 1344.0514 1354.3008 1355.4346 1360.8187 1373.6001 1382.7591 1388.7276 1393.8174 1405.1961 1413.8171 1450.4274 1456.3112 1456.6758 1463.7310 1468.1341 1480.1601 1480.3961 1481.3771 1482.3884 1488.6549 1491.4016 1493.9933 1496.7704 1496.9651 1497.5378 1497.8990 1497.9627 1500.4412 1501.9317 1502.2206 1509.5443 1509.7674 1511.4702 1514.4351 1516.4101 1546.7481 1551.4858 1553.2101 1623.7807 1625.9221 1626.0542 1634.1288 1638.4489 1649.0117 1660.7803 1661.5508 1662.7412 1663.7147 3011.4847 3015.8190 3016.0218 3016.4506 3018.4109 3023.8766 3029.8251 3029.9258 3042.7232 3057.3802 3073.9560 3078.6029 3078.9538 3079.8139 3081.7879 3083.0263 3096.8534 3099.3436 3101.9978 3141.9656 3148.8795 3149.2152 3149.2475 3150.9563 3167.8718 3168.2802 3168.8622 3195.8871 3205.5908 3207.2210 3208.9693 3211.7018 3214.9872 3215.8657 3219.6526 3222.5156 3226.0230 3228.6364 3232.0066 3236.0413
redmass: 5.9131 6.0820 5.0716 5.0282 5.4523 4.7864 4.1046 4.5017 5.3381 4.1550 4.0986 4.1592 3.6738 3.3023 3.2550 3.6309 3.6016 3.8894 5.0254 4.0466 4.3510 2.4816 1.8169 3.2992 3.9314 4.6863 4.5762 2.9323 3.7794 3.7448 1.6612 3.4433 2.0130 1.4223 3.7240 1.3879 3.1213 3.4698 1.8279 2.2283 3.1885 3.6064 5.1307 4.3117 4.4170 3.8952 4.2595 2.9546 3.5912 4.5034 4.5203 3.2979 3.1406 3.7416 3.4149 5.9328 4.7586 5.1558 5.0573 4.7329 4.0070 3.5012 3.5486 4.4516 3.7129 4.3023 3.3937 5.1825 3.3790 5.0567 5.1414 5.1750 4.4349 4.7228 5.7750 5.0585 6.8711 5.9694 6.7979 3.9474 3.7928 2.9648 3.1408 3.5368 3.6746 4.0147 4.7599 4.3615 3.8551 3.9271 3.6562 2.9858 1.8423 1.8461 1.4104 1.3828 1.8793 1.8471 1.7212 1.8738 3.4368 1.6433 2.0707 2.3390 3.9751 1.7860 2.5238 3.4356 3.2932 1.3247 1.7901 1.4505 2.3357 2.5338 1.4767 1.3903 1.3379 5.2442 5.1208 6.1517 4.3539 2.5868 2.8962 2.6228 1.9323 2.0587 4.5754 6.0368 5.9068 2.9421 3.7540 2.1986 5.0536 1.4845 1.3679 1.6588 2.0049 1.8607 1.2728 1.2719 1.2722 1.2716 1.2691 1.6838 1.5240 1.6461 1.1869 1.1681 1.3298 1.4115 1.4033 1.3807 1.4158 1.6154 1.5132 2.6032 1.9130 2.0944 2.5216 2.0728 2.2128 1.5301 4.0481 4.2608 1.6948 1.9715 1.5290 2.1999 2.3844 1.4394 1.3985 1.8539 2.4551 2.7045 2.9481 2.8850 1.7136 2.4280 1.4466 4.1746 1.8903 1.5420 2.4483 2.8375 2.6730 2.7057 2.2648 1.4116 1.1885 1.1873 1.3701 1.2754 1.1461 1.7671 1.2537 1.0481 1.0471 1.0484 1.3591 1.2752 1.6427 1.0957 1.8387 1.0578 1.0584 1.1190 1.1136 1.4288 2.4978 2.4924 2.5727 6.6062 6.5978 6.6339 8.9421 6.0849 6.4237 7.5317 6.5701 5.7962 6.0656 1.0852 1.0342 1.0343 1.0343 1.0341 1.0366 1.0635 1.0714 1.0665 1.0821 1.0853 1.1062 1.1063 1.1063 1.1014 1.1061 1.0969 1.0957 1.0976 1.1050 1.1002 1.0998 1.0998 1.0998 1.0885 1.0890 1.0889 1.0889 1.0930 1.0929 1.0930 1.0877 1.0882 1.0907 1.0897 1.0920 1.0937 1.0924 1.0929 1.0904
irintensity: 0.0728 0.1000 0.0934 0.3661 0.0344 0.1593 0.6956 0.7816 0.3431 0.7781 0.2269 0.3868 2.3301 4.8845 2.8613 1.2961 0.0136 3.9825 0.9580 4.8200 0.2366 1.0357 0.1206 0.6747 3.3696 3.8800 0.1612 0.7600 0.1699 2.6443 0.1681 2.4136 0.2255 0.3730 1.9437 0.3294 1.2279 2.5847 1.0271 0.1419 0.4221 2.1398 4.7946 0.6807 3.7161 2.6397 0.2850 7.1737 4.2620 2.6868 0.9959 0.2584 0.2155 0.9890 0.7984 1.7062 0.5466 1.2992 9.7438 0.4875 6.4418 9.5367 10.5550 7.0817 5.2784 19.6793 9.7579 8.2391 13.1494 5.5308 2.4893 22.9908 0.5352 5.2220 8.8386 5.3852 1.3315 4.4073 1.4425 1.9015 3.7979 4.7952 4.2052 5.3115 0.7031 3.1855 12.5435 10.5559 14.3088 11.4050 12.3393 3.0051 1.9893 40.7718 16.8181 7.7174 13.7114 45.1381 23.1171 24.8203 13.9653 28.4384 21.8336 27.5205 3.2930 19.6222 0.4194 6.1681 15.0223 1.4705 5.0414 4.3879 10.1290 60.2575 11.0499 5.3549 0.1228 5.7268 58.0881 0.1674 18.0997 4.4106 4.1192 0.8281 3.9098 14.3493 85.6223 52.7060 44.5056 30.4358 58.2037 54.9633 143.9376 83.1681 43.9473 144.3034 226.1135 114.7804 0.3108 0.9126 0.8925 1.5347 22.5310 21.5708 108.4599 125.6790 61.3186 27.6406 34.0664 22.0891 15.4863 13.5661 2.2400 23.4353 7.4731 4.8910 128.5756 98.0660 46.5806 211.5445 82.4781 3.0900 264.7980 219.7654 120.3467 19.8110 17.6416 93.7707 24.7657 14.5562 4.4642 19.6294 15.6842 50.5601 86.9833 14.8683 59.8993 67.3504 5.4644 72.0019 23.7411 3.2800 37.7627 10.5287 7.0008 18.7256 62.1604 33.9778 12.0001 7.1101 9.1886 5.1814 2.2914 91.0588 12.2829 9.9600 4.1475 4.9465 46.9193 52.4060 41.2190 6.5203 63.9121 32.4449 33.2920 20.5667 6.4654 4.7095 164.2069 98.2772 122.2317 31.3851 13.1159 22.8464 58.7453 241.5497 168.6371 198.0194 206.2653 78.3261 21.5471 33.2367 20.1640 105.2622 55.4586 50.6539 49.5368 39.4248 26.1857 16.6740 55.7618 14.4791 41.7434 30.2263 39.5747 20.3849 32.5770 35.6493 42.0454 17.9851 19.6090 23.9315 33.4140 16.2433 21.5953 16.1375 12.6997 12.3261 4.2419 10.2982 8.6156 5.3105 6.3418 2.7684 0.4489 4.9902 7.8415 5.0423 0.3375 6.0907 2.1044
temp: 298.150 k
press: 1.00000 atm
elementType: 6 6 6 6 6 6 1 1 1 1 8 6 1 1 1 6 6 1 6 1 6 8 6 6 6 6 1 6 1 6 1 8 8 6 1 1 1 6 1 1 1 6 1 6 6 6 8 6 1 1 1 6 1 1 6 1 1 6 8 6 6 6 6 1 6 1 6 1 1 8 6 1 1 6 6 6 6 1 6 1 6 1 1 8 6 1 1 1 1
symmnumber: 1
zpe: 1907167.7 jmol-1
zpe.correction: 0.726402 hartree
zpe.thermalcorrener: 0.770974 hartree
zpe.thermalcorrenthalpy: 0.771918 hartree
zpe.thermalcorrgfe: 0.641007 hartree
zpe.sumelectzpe: -2187.573633 hartree
zpe.sumelectthermal: -2187.529061 hartree
zpe.sumelectthermalent: -2187.528116 hartree
zpe.sumelectthermalfe: -2187.659028 hartree
dipole: 2.0500 -1.4586 3.1322
dipole: 4.0176
quadrupole: -259.6975 -265.3547 -276.6962
quadrupole: 13.3804 -1.7873 0.1296
quadrupole: 7.5520 1.8947 -9.4467 13.3804 -1.7873 0.1296
hfenergy: -2188.3000347 hartree
pointgroup: C01[X(C41H40O8)]
dipole: 0.8065251 -0.5738524 1.2323199 debye
polarizability: 612.7645661|-22.1281309|489.678984|-13.4049779|21.7845947|437.791098 unknown
InChI: InChI=1/41C.8O.40H
charge 0 multiplicity 1
89 atoms
C  5.83813709 -0.93038288 -2.59594478
C  4.52544367 -0.93075199 -2.13727922
C  3.89886369 0.25340897 -1.71732356
C  4.62210731 1.4458809 -1.79361083
C  5.93986206 1.4667775 -2.26223241
C  6.55564083 0.27323086 -2.65837005
H  6.32159211 -1.84517102 -2.9233529
H  3.97568923 -1.86914861 -2.11127746
H  4.15026148 2.37511423 -1.49452895
H  6.46673474 2.41224519 -2.3121518
O  7.83798522 0.17849341 -3.1266929
C  8.61392911 1.36598307 -3.22416057
H  8.74986063 1.83733735 -2.24257559
H  9.58434962 1.05594068 -3.61402988
H  8.15807777 2.08667479 -3.91479117
C  2.49204034 0.1968739 -1.18834192
C  2.27310072 0.00436134 0.36658675
H  1.95956569 -0.63079392 -1.67811087
C  0.93051307 0.69527996 0.49718796
H  2.19683859 -1.06882266 0.56755125
C  0.73812706 1.50833931 -0.62430838
O  1.76582756 1.41095279 -1.52668692
C  3.38268993 0.57151931 1.24565048
C  3.45443727 1.93038396 1.53831224
C  4.36729142 -0.30528761 1.73859971
C  4.51219813 2.42516213 2.3202129
H  2.70241219 2.6256917 1.18241362
C  5.41356476 0.19762372 2.51420312
H  4.30185135 -1.36080977 1.50432458
C  5.4943147 1.56780564 2.81398472
H  6.32096493 1.91054232 3.42279933
O  4.4923129 3.77397836 2.54881911
O  6.41943783 -0.56568169 3.04215777
C  5.52996557 4.34594025 3.33452812
H  6.51310369 4.19377846 2.87143532
H  5.31304457 5.41393559 3.38146072
H  5.53809811 3.93090927 4.35034817
C  6.43349549 -1.96020871 2.76158249
H  7.3187053 -2.35429851 3.26259093
H  5.53963409 -2.45727039 3.15911038
H  6.5091106 -2.14985545 1.68392223
C  -0.37978638 2.30558217 -0.80070244
H  -0.52151382 2.92451495 -1.67857149
C  -0.06117758 0.66015373 1.47407277
C  -1.36454896 2.2485328 0.1992275
C  -1.23443507 1.431486 1.3379352
O  0.04697105 -0.19566748 2.55621571
C  0.74123908 0.32694314 3.6969522
H  0.67618767 -0.44240074 4.46922941
H  1.79092158 0.53076821 3.46525168
H  0.26811552 1.24843469 4.05964919
C  -2.35049277 1.3780015 2.35586126
H  -2.98637372 0.50109017 2.17323623
H  -1.94772329 1.25480437 3.36465182
C  -3.1913612 2.65451573 2.27271746
H  -2.60753031 3.51235368 2.62893771
H  -4.08230794 2.57846129 2.90391067
C  -3.61659843 2.92996341 0.82298388
O  -2.46308678 3.03934868 -0.03167292
C  -4.62224798 1.92150186 0.27918482
C  -4.31808794 1.02676889 -0.74787942
C  -5.92012413 1.88786823 0.81793994
C  -5.26371715 0.10863446 -1.22298697
H  -3.33098274 1.03671888 -1.19598084
C  -6.87222404 0.98684957 0.35554869
H  -6.19893057 2.58451057 1.60561006
C  -6.54777335 0.08687918 -0.67112779
H  -4.97744189 -0.58535491 -2.00331573
H  -7.87653379 0.9700229 0.76679881
O  -7.56048123 -0.75277305 -1.05999751
C  -7.36555994 -1.62870827 -2.17361887
H  -8.38463115 -1.91469865 -2.45484078
H  -6.93242647 -1.0780977 -3.01908839
C  -6.53864377 -2.85996451 -1.85945329
C  -6.6066423 -3.4795689 -0.60962332
C  -5.72245937 -3.438143 -2.84371196
C  -5.88071779 -4.64317217 -0.33387757
H  -7.22509485 -3.04273467 0.1687946
C  -5.00155065 -4.60086769 -2.5910662
H  -5.64473432 -2.97184717 -3.82365241
C  -5.07531072 -5.21029024 -1.32988429
H  -5.95140274 -5.08992404 0.65070956
H  -4.36740446 -5.04686204 -3.35038404
O  -4.3260255 -6.34313985 -1.170951
C  -4.34600971 -6.99948828 0.09053869
H  -3.68337753 -7.85975993 -0.0116525
H  -3.97231765 -6.34496169 0.88798879
H  -5.3553589 -7.34653277 0.34545858
H  -4.06760644 3.92737694 0.76862276
