program: Gaussian 09
title: 000052778
version: EM64L-G09RevD.01
frameworkgroup: C1[X(C11H10N2O2)]
method: RPBEPBE
basis: SDD
operation: Freq
keyword: #p
keyword: freq=noraman
keyword: PBEPBE/SDD
title: #p freq=noraman PBEPBE/SDD
converged: YES YES NO NO
title: Mulliken charges:
elementType: O O N N C C C C C C C C C C C H H H H H H H H H H
charge: -0.192873 -0.414366 -0.101276 -0.096640 -0.493636 0.115567 0.304729 -0.161643 -0.300268 -0.321891 -0.209763 -0.403909 -0.345223 0.300060 -0.320478 0.254975 0.245910 0.259863 0.241009 0.283245 0.252879 0.228315 0.262734 0.249909 0.362769
chargesum: 0.00000
title: Mulliken charges with hydrogens summed into heavy atoms:
elementType: O O N N C C C C C C C C C C C
charge: -0.192873 -0.051596 -0.101276 -0.096640 0.007249 0.115567 0.304729 0.098220 -0.059259 -0.038646 0.043116 -0.175594 -0.082488 0.300060 -0.070569
polarizability: 2.17440466e+02 -1.61850292e+01 1.17136954e+02 2.94500587e+00 2.18537654e+00 8.10438817e+01
1716.lowfreq: -12.8549 -5.1101 -3.4526 -0.0012 -0.0011 -0.0006 13.1611 28.3646 62.1881
frequency: 12.0642 28.3531 62.1786 71.7496 104.3571 148.6439 256.0203 273.3662 297.0889 328.5019 376.8822 398.8364 413.1974 445.4651 483.1418 565.0634 580.5808 616.9512 630.0914 651.4537 710.3608 720.4368 728.5934 763.0471 793.4994 802.8487 816.9336 841.5705 853.2673 878.8368 929.1810 960.9347 969.4285 999.1975 1002.1283 1014.0688 1055.6827 1107.0244 1108.0231 1143.6441 1165.6948 1183.2771 1224.3681 1233.2520 1262.1386 1270.6123 1308.4122 1317.7430 1347.8055 1363.8461 1395.8672 1434.7970 1436.8690 1462.8010 1483.1104 1504.7156 1572.9169 1607.5961 1625.4350 2987.1985 3048.5073 3121.2758 3151.5759 3156.3848 3178.7293 3225.7094 3226.5731 3255.1156 3575.6599
redmass: 4.7694 5.2815 4.7425 4.6491 6.8608 6.3563 7.3030 5.7422 5.2707 2.4926 5.0124 1.3232 2.0867 5.5274 3.1884 2.5448 6.1742 3.1604 7.0412 3.3120 5.0307 1.3023 3.6284 1.4402 5.0939 1.3938 6.0842 1.4454 1.4393 6.2871 1.4990 2.0441 5.3325 1.3877 2.6204 3.2492 1.7092 1.4222 1.8055 1.3444 1.4345 1.1269 1.6379 2.3192 2.7999 1.9196 1.4803 1.4755 4.3453 3.3660 4.6384 2.8742 1.9926 1.8569 3.4003 2.5522 7.0532 7.9745 6.6869 1.0610 1.0992 1.0887 1.0952 1.0891 1.0970 1.0934 1.0953 1.1098 1.0661
irintensity: 1.8912 2.1425 1.5206 2.7929 0.0426 1.1228 0.6561 0.0645 2.5771 1.0942 16.9651 113.2330 37.0888 6.7301 11.5651 19.9769 28.3453 15.8308 2.0784 15.4133 4.9452 21.9800 0.0603 70.7127 20.8550 38.1613 2.5563 3.8049 42.1634 12.3697 0.3297 2.4034 33.2129 0.3855 1.8210 48.7266 24.7221 74.1174 13.1374 330.8940 3.6517 57.4728 61.5930 139.5289 50.3476 29.2689 2.9073 58.6815 2.7832 1.4279 4.7162 22.8601 10.7796 39.7771 31.5495 15.3699 170.7846 142.4448 87.7225 47.4326 4.6819 15.7519 11.5694 0.0970 5.3514 6.1183 0.0579 2.7362 71.1093
temp: 298.150 k
press: 1.00000 atm
elementType: 8 8 7 7 6 6 6 6 6 6 6 6 6 6 6 1 1 1 1 1 1 1 1 1 1
symmnumber: 1
zpe: 496873.0 jmol-1
zpe.correction: 0.189249 hartree
zpe.thermalcorrener: 0.202162 hartree
zpe.thermalcorrenthalpy: 0.203106 hartree
zpe.thermalcorrgfe: 0.146909 hartree
zpe.sumelectzpe: -684.032995 hartree
zpe.sumelectthermal: -684.020082 hartree
zpe.sumelectthermalent: -684.019138 hartree
zpe.sumelectthermalfe: -684.075335 hartree
dipole: 7.0340 -4.2272 2.1078
dipole: 8.4729
quadrupole: -103.4042 -81.4650 -87.0133
quadrupole: -9.6530 -7.2522 1.3401
quadrupole: -12.7767 9.1625 3.6142 -9.6530 -7.2522 1.3401
hfenergy: -684.222244 hartree
pointgroup: C01 [X(C11H10N2O2)]
dipole: 2.7585246 1.8310829 -0.3870232 debye
dipolederiv: -0.9431067 -0.1241293 -0.0089376 -0.4255015 -0.7489207 -0.0391714 -0.0743647 -0.0488759 -0.2705905 -1.7353835 -0.2449899 -0.0363389 -0.2352593 -0.1059285 0.0271675 -0.0387904 0.0266021 -0.4126682 -0.9626989 -0.0975611 0.0460659 -0.134483 -0.1433319 0.009199 0.0138035 -0.0062703 -0.0520157 -0.6968387 -0.0253416 0.0442896 -0.1175024 -0.2591863 0.0047078 -0.0331647 0.0136813 -0.2654702 0.5200421 0.1442122 -0.0037036 0.4716879 -0.0318123 -0.0531725 0.0408188 -0.0449557 0.1970041 1.9520553 0.0871245 0.0262757 0.057914 0.8038076 0.0550024 0.032628 0.0786587 0.1117858 -1.1606763 -0.1200777 -0.0186452 0.0627287 -0.2121994 -0.0145496 -0.0024917 -0.0226703 -0.0556147 0.3052397 0.0556209 -0.0106252 0.116808 -0.1057173 0.0674125 0.3475946 0.0603257 -0.1077141 0.394355 0.1010044 0.0161769 0.2028059 0.1228801 0.0208472 0.0291498 0.0244667 -0.0994669 0.3392186 0.0523921 0.0094066 -0.2016944 0.0788455 0.0146008 -0.0125581 0.0153153 -0.0769247 0.6378515 0.0876086 -0.1406835 0.0842579 -0.0946656 0.0011597 -0.4159995 0.016001 0.103014 -0.6342243 -0.042446 -0.0072805 0.4223031 0.0332271 0.0275789 0.0318417 0.0231084 -0.1992652 -0.3886298 -0.1437125 -0.0151182 -0.4604791 -0.0703413 0.0059428 -0.0491937 0.0081243 -0.1719184 1.6861779 0.2479925 0.0400264 0.1639919 0.2110761 0.0114333 0.0360841 0.0132205 0.1106158 -0.0300926 0.1090326 0.0999119 0.1005676 -0.1425123 0.0959293 0.102687 0.0570341 0.0875374 -0.06765 -0.0292093 0.0311231 -0.0737903 0.02669 0.0561829 0.1053412 0.0893699 0.0020738 -0.0075743 -0.0100803 -0.0172447 -0.0415225 0.0599311 -0.0451796 -0.0882332 -0.0802829 -0.0127726 0.0877012 -0.0130119 0.0992954 -0.024755 0.1899535 -0.0420911 0.0682786 -0.0333886 0.0305275 0.0380756 0.1010582 0.0082465 0.1235562 -0.0116055 -0.0131213 0.0131891 -0.0145343 0.1347056 0.127884 -0.0645312 -0.0075258 -0.0130593 0.0205843 -0.0124826 -0.0006749 -0.0139874 0.1465861 0.0684984 -0.0538057 -0.0702904 -0.0545154 0.1677342 -0.0556029 -0.0553114 -0.049155 0.0169652 -0.0040858 -0.0922076 -0.010538 -0.0906287 -0.0552203 -0.0231321 -0.0111535 -0.0236465 0.1717061 0.0156774 0.0702191 0.0050438 0.0707949 0.0234691 -0.0136792 0.0046064 -0.0137664 0.1712948 0.0089205 -0.0619668 -0.0857178 -0.0652329 0.1649269 -0.0555759 -0.0510085 -0.0451054 0.0541195 0.4492633 0.0668061 0.0067877 0.0610075 0.0783159 -0.0294059 0.0069212 -0.0292695 0.3864856 unknown
polarizability: 217.2753784|16.9148644|113.9957863|1.1760027|10.6483564|84.3501366 unknown
InChI: InChI=1S/C11H10N2O2/c14-10-3-1-9(2-4-10)11(15)7-13-6-5-12-8-13/h1-6,8,14H,7H2
charge 0 multiplicity 1
25 atoms
O  -0.750176 -1.579867 -0.218597
O  5.394234 0.302943 0.043734
N  -2.638979 0.474335 -0.005998
N  -4.746952 0.109549 0.75379
C  -1.22197 0.813929 0.00405
C  -0.279377 -0.415714 -0.09679
C  1.190547 -0.157542 -0.054448
C  -3.38588 0.018989 -1.101329
C  1.750617 1.143078 0.078741
C  2.073306 -1.273259 -0.151682
C  -3.505176 0.502512 1.090284
C  3.145347 1.327727 0.114874
C  3.463535 -1.103876 -0.117385
C  4.001599 0.201212 0.016347
C  -4.677558 -0.19453 -0.617595
H  -0.992878 1.505164 -0.830537
H  -1.001296 1.360077 0.940172
H  -2.942346 -0.131446 -2.081688
H  1.107785 2.026213 0.155259
H  1.631684 -2.269903 -0.253429
H  -3.18448 0.813281 2.082517
H  3.565785 2.336055 0.218212
H  4.149049 -1.952675 -0.190816
H  -5.550985 -0.548741 -1.159743
H  5.690165 1.242891 0.137457
