program: Gaussian 16
title: NMR project
version: ES64L-G16RevC.01
method: RB3LYP
basis: 6-31+G(d,p)
operation: Freq
keyword: #N
keyword: Geom=AllCheck
keyword: Guess=TCheck
keyword: SCRF=Check
keyword: GenChk
keyword: RB3LYP/6-31+G(d,p)
keyword: Freq
converged: YES YES NO YES
title: Mulliken charges:
elementType: C C C C C C H H H H O C H H H C C H C H C O C C C C H C H C H O O C H H H C H H H C H C C C O C H H H C H H C H H C O C C C C H C H C H H O C H H C C C C H C H C H H O C H H H H
charge: 0.203352 -0.308405 0.234541 -0.021669 -0.076367 -0.051384 0.116301 0.131620 0.107736 0.129709 -0.336738 -0.145763 0.144965 0.145652 0.148348 -0.189342 -0.146267 0.123997 0.565323 0.126591 -0.545526 -0.209184 0.578035 0.018031 -0.340193 -0.619770 0.096213 -0.197673 0.140039 0.212836 0.125342 -0.308974 -0.337391 -0.139844 0.145802 0.140173 0.153682 -0.123429 0.147341 0.144527 0.143093 -0.120985 0.132999 0.186211 -0.331884 0.116289 -0.287958 -0.054729 0.139954 0.139403 0.158131 -0.329108 0.161631 0.160507 -0.603204 0.153930 0.136423 0.174816 -0.297528 0.558559 -0.103477 -0.313472 -0.170284 0.115071 -0.188425 0.132219 -0.326333 0.129452 0.120731 -0.274548 -0.119513 0.158095 0.130729 0.261287 -0.501075 0.010756 0.391733 0.109820 -0.084334 0.134347 -0.264935 0.118075 0.133134 -0.354196 -0.138876 0.143567 0.149886 0.143999 0.137778
chargesum: -0.00000
title: Mulliken charges with hydrogens summed into heavy atoms:
elementType: C C C C C C O C C C C C O C C C C C C O O C C C C C C O C C C C O C C C C C C O C C C C C C C O C
charge: 0.319653 -0.176784 0.234541 0.086067 0.053343 -0.051384 -0.336738 0.293202 -0.065346 -0.019676 0.565323 -0.545526 -0.209184 0.578035 0.114244 -0.200154 -0.619770 -0.197673 0.338177 -0.308974 -0.337391 0.299814 0.311532 0.012014 0.186211 -0.331884 0.116289 -0.287958 0.382759 -0.006970 -0.312851 0.312593 -0.297528 0.558559 0.011594 -0.181253 -0.040832 -0.067694 -0.326333 -0.274548 0.169311 0.261287 -0.391255 0.145103 0.509808 0.048801 -0.264935 -0.354196 0.298577
1716.lowfreq: -3.1370 -2.0844 -1.0701 -0.0004 0.0003 0.0009 4.5000 6.6367 15.1414
frequency: 4.4902 6.5389 15.1407 17.8696 18.5321 24.0118 25.8511 28.0768 32.0605 38.8296 48.0544 52.7801 68.5197 77.6759 83.7755 86.9649 91.9756 103.6115 112.7734 122.0200 133.5293 143.8421 148.6904 160.6532 170.6098 188.0440 189.4995 191.5261 199.0031 207.7854 220.2188 227.9841 230.5201 238.7624 245.2067 248.7861 251.9892 273.5841 274.5536 278.2915 286.6823 295.0438 300.1613 307.9283 320.0139 326.1233 343.3472 347.5734 362.0654 373.0021 404.2115 422.4934 422.8801 424.5688 425.5036 431.3398 436.5047 462.3907 475.6733 487.2406 499.7964 515.2874 520.6468 527.3719 534.0767 543.0380 547.8682 548.4099 556.6074 569.0497 593.2064 604.7086 624.9121 627.1529 629.9912 640.5755 643.8079 646.4984 654.2196 659.0484 680.4722 696.8040 700.2486 710.3656 718.9368 727.4442 739.5732 753.3877 768.6280 789.7425 792.0532 812.9499 817.9243 821.2551 822.6657 826.5611 829.5336 830.9368 840.1915 841.0108 845.0137 848.8926 851.5046 858.5546 868.2550 886.1679 913.6647 929.1610 939.7129 945.4419 951.7416 953.6329 957.5134 968.5594 969.0867 975.7084 977.8948 994.3249 1006.5041 1013.0133 1020.9791 1024.5128 1027.0015 1028.7316 1032.8662 1043.9660 1052.0421 1066.8878 1067.0438 1085.0491 1088.9681 1096.5759 1126.6374 1136.6875 1137.3135 1142.6155 1156.1503 1168.8544 1172.0116 1172.1223 1172.1867 1172.5694 1172.8361 1179.9733 1186.0399 1189.0415 1197.5828 1198.0099 1202.3050 1205.6494 1205.7165 1206.8642 1210.4445 1216.9696 1224.2393 1225.9629 1232.8916 1237.6334 1250.8975 1256.2927 1262.3945 1273.1341 1281.5322 1285.5073 1297.1405 1300.2028 1318.4096 1321.2359 1329.3965 1332.8261 1333.6716 1337.4695 1344.1113 1345.3751 1354.3300 1358.2925 1361.4668 1378.9475 1383.8029 1391.3767 1394.3675 1405.8431 1417.9528 1449.0913 1454.7658 1456.8058 1461.6274 1467.0228 1479.7241 1480.1905 1481.3288 1482.9839 1490.3942 1493.3467 1496.6504 1496.8772 1497.4492 1497.5483 1497.5839 1499.8213 1500.2105 1501.0652 1501.3287 1509.2632 1509.6666 1511.1245 1515.9693 1519.1975 1546.4779 1550.7203 1552.9061 1623.6321 1625.5826 1625.8392 1630.6580 1638.1198 1649.9779 1660.6691 1661.4705 1662.8016 1663.5881 3004.6174 3015.2687 3015.7501 3016.7224 3016.9786 3026.2147 3028.3155 3031.0277 3043.3586 3056.5729 3078.0334 3078.5056 3080.1266 3081.5211 3082.1650 3082.7842 3093.4297 3097.9653 3107.3607 3137.9094 3148.1227 3149.5219 3149.7755 3150.6156 3167.2972 3167.3909 3170.2234 3194.5867 3205.8226 3206.7557 3210.7745 3210.9909 3215.8276 3216.4621 3220.3973 3221.5405 3225.4694 3232.0145 3232.7366 3236.0937
redmass: 5.8101 5.9462 5.5071 5.5486 4.7176 4.7515 4.1067 4.7843 5.1254 4.0505 3.9079 4.0531 3.4589 3.6451 3.6031 3.6475 3.4278 5.0509 5.5812 5.0229 4.8387 4.5172 4.2426 4.2133 4.5749 5.1286 4.3294 2.7079 3.4897 1.6444 2.0635 2.9338 2.6918 1.6192 1.3350 2.8885 1.3776 2.6206 1.8371 1.9093 3.4951 4.0823 5.5821 4.0045 3.8876 3.8726 4.5262 3.7572 2.7841 4.3666 4.8035 3.5435 3.1643 3.1339 3.9965 5.9270 4.6854 4.8521 4.9424 5.0273 4.6376 3.3596 2.9260 3.7862 4.5133 3.7484 5.1335 3.7657 4.1216 4.8110 5.5608 4.5639 4.3189 4.2037 5.3481 4.9608 5.2628 6.3334 6.0871 6.4221 4.6411 2.3993 3.7099 3.5503 3.5627 4.0388 5.0166 4.3710 3.8851 2.9243 4.2617 2.5981 1.6432 1.5890 1.5509 1.4743 1.7224 1.7547 2.0911 1.6914 2.6283 2.5687 2.0649 2.4813 3.5102 1.9203 2.5508 3.3613 1.3114 3.1214 1.9325 1.4818 2.3010 1.3601 1.3515 3.0060 1.3230 4.7535 6.0538 4.7093 2.4244 2.9764 3.7889 3.2096 2.0550 2.1115 4.0892 6.0525 6.1762 3.4426 3.1196 2.1934 3.2560 1.3555 1.3791 1.4052 3.3466 1.8843 1.2725 1.2727 1.2721 1.2727 1.2930 1.8346 1.5640 1.6588 1.1784 1.1695 1.2911 1.4184 1.4053 1.4710 1.4188 1.4599 2.7116 1.8132 1.9047 1.9954 2.1249 2.2920 2.0748 1.5274 4.0377 4.0699 1.7590 1.9414 1.4987 2.1891 2.1325 1.4715 1.3685 1.9627 2.3697 2.8506 2.7639 2.9152 1.6906 2.0743 1.4865 2.7338 2.5170 1.5306 2.8531 2.8844 2.8902 2.7155 2.5886 1.4498 1.1826 1.1931 1.3689 1.4335 1.5224 1.2980 1.0470 1.0480 1.0743 1.1653 1.2613 1.7508 1.4376 1.4170 1.0975 1.0566 1.0591 1.1049 1.4050 1.0832 2.4940 2.4964 2.5728 6.6203 6.5793 6.6969 8.9866 5.9792 6.4874 7.2214 6.2273 5.8455 6.4794 1.0850 1.0344 1.0342 1.0342 1.0344 1.0707 1.0348 1.0624 1.0684 1.0803 1.1062 1.1062 1.1063 1.1055 1.0844 1.1020 1.0912 1.1020 1.1037 1.1031 1.1001 1.0998 1.0999 1.0996 1.0894 1.0889 1.0884 1.0879 1.0931 1.0928 1.0880 1.0946 1.0881 1.0894 1.0908 1.0913 1.0936 1.0925 1.0928 1.0903
irintensity: 0.0989 0.1148 0.2577 0.1774 0.0443 0.2511 0.2199 0.2436 0.4263 0.9048 0.2904 2.0681 1.5299 6.1910 5.3673 0.9737 0.0824 1.2749 3.6814 2.5355 0.8865 0.3819 2.1572 1.0508 2.0739 2.5475 0.2282 0.3880 0.2871 0.8122 0.9332 2.2516 2.7741 0.6824 0.3478 3.1808 0.3212 0.3117 0.9107 0.2945 0.5794 0.2510 2.1322 3.5851 1.4277 0.9588 6.9510 2.7982 0.3604 5.0195 2.2603 0.4512 0.9082 0.6791 1.1435 0.1576 1.1252 2.7421 6.8815 0.6633 2.6025 6.4658 18.0519 4.1940 28.3626 15.1285 5.1606 7.0881 6.8432 6.5000 10.2448 14.0865 1.3162 6.1202 5.7048 3.3323 6.4793 0.1807 4.0245 3.3499 0.7601 7.4663 2.3076 6.2983 0.1669 1.4479 6.1595 7.2913 25.0327 10.7622 12.0895 0.9510 33.7684 11.7890 23.6014 6.9648 19.4102 37.8084 25.3734 31.3241 3.8779 23.5661 21.2749 30.3317 3.7729 15.4161 0.3627 2.2494 1.9838 5.6261 7.8658 5.5307 7.7189 1.8846 0.6574 61.3354 0.2942 3.6592 1.6834 66.6316 5.4271 3.2497 11.5741 2.3594 12.2054 17.5426 87.4155 46.0739 41.0096 36.2223 54.2895 48.1098 118.6469 35.4900 14.3550 25.7428 454.5284 98.6622 1.1613 0.6020 0.5051 2.8495 9.8478 27.7629 84.0840 146.7963 58.0831 23.5473 52.0310 16.3400 18.5977 13.1315 2.6039 6.3470 4.9774 6.3618 133.1974 109.4163 244.6627 29.9150 74.3806 19.6053 273.5353 260.3839 70.0515 49.7447 12.6270 91.0736 34.0835 21.4937 2.8219 26.3611 25.2979 38.0776 13.8303 74.5115 46.9479 39.1917 4.3495 56.3084 37.4167 25.4060 39.1939 19.6263 37.8154 3.5103 56.1750 37.7013 6.2210 13.8226 7.8581 16.8357 72.1600 29.7389 10.1726 4.5510 6.4971 24.9312 57.9977 19.0534 51.1457 38.1172 6.8940 33.8013 29.9152 24.1495 5.5383 20.3948 168.9934 92.0858 121.1405 33.8501 6.7789 29.7001 115.5393 221.3104 170.4501 258.2883 159.4952 77.5930 37.8149 35.9658 56.1631 57.6181 63.8178 53.5843 20.7523 47.2258 47.2838 13.6315 58.0433 42.3031 34.8328 38.4892 29.5930 26.0127 19.6306 20.0368 41.4226 23.2338 23.3217 25.7538 21.4789 25.9505 22.0267 12.4852 13.4075 15.9294 3.3433 10.3873 9.0450 5.0472 5.3484 2.5701 5.5858 0.6238 8.3659 5.4153 0.2842 6.5431 2.1604
temp: 298.150 k
press: 1.00000 atm
elementType: 6 6 6 6 6 6 1 1 1 1 8 6 1 1 1 6 6 1 6 1 6 8 6 6 6 6 1 6 1 6 1 8 8 6 1 1 1 6 1 1 1 6 1 6 6 6 8 6 1 1 1 6 1 1 6 1 1 6 8 6 6 6 6 1 6 1 6 1 1 8 6 1 1 6 6 6 6 1 6 1 6 1 1 8 6 1 1 1 1
symmnumber: 1
zpe: 1908337.5 jmol-1
zpe.correction: 0.726847 hartree
zpe.thermalcorrener: 0.771248 hartree
zpe.thermalcorrenthalpy: 0.772192 hartree
zpe.thermalcorrgfe: 0.641401 hartree
zpe.sumelectzpe: -2187.574148 hartree
zpe.sumelectthermal: -2187.529747 hartree
zpe.sumelectthermalent: -2187.528803 hartree
zpe.sumelectthermalfe: -2187.659594 hartree
dipole: 3.0996 -2.8226 0.7481
dipole: 4.2584
quadrupole: -267.5345 -260.0415 -281.5484
quadrupole: 7.4114 6.5583 12.0450
quadrupole: 2.1736 9.6667 -11.8402 7.4114 6.5583 12.0450
hfenergy: -2188.300995 hartree
pointgroup: C01 [X(C41H40O8)]
dipole: 1.2194596 -1.1105049 0.2943178 debye
polarizability: 613.8473616|-32.514203|503.7810397|-12.4413755|24.7744164|421.7266611 unknown
InChI: InChI=1/41C.8O.40H
charge 0 multiplicity 1
89 atoms
C  5.97814555 1.09700115 -2.16690166
C  4.64094243 1.09380764 -1.75858142
C  3.92955992 -0.10006418 -1.61451134
C  4.58945358 -1.30440752 -1.90411005
C  5.92254966 -1.32138096 -2.30100706
C  6.62701312 -0.11573777 -2.43205737
H  6.49539674 2.04328441 -2.27148349
H  4.14463959 2.03706959 -1.55867248
H  4.05031466 -2.24606397 -1.82475752
H  6.4318659 -2.25226617 -2.52879356
O  7.93096811 -0.22800281 -2.83093857
C  8.69566424 0.96006402 -2.99383847
H  8.26340446 1.61184842 -3.76346159
H  8.77958788 1.51475994 -2.0508315
H  9.68699027 0.63412899 -3.31134203
C  2.50064793 -0.12881802 -1.14489564
C  2.21416965 -0.10866905 0.40913639
H  2.01669075 -1.03682564 -1.5331562
C  0.84514435 0.5592818 0.39500287
H  2.17948748 -1.15301539 0.73040211
C  0.70881003 1.2202135 -0.83680176
O  1.76483549 0.99658163 -1.68076653
C  3.26396349 0.6023987 1.25983334
C  4.3371927 -0.15360714 1.77252703
C  3.19340084 1.96732594 1.51546246
C  5.32782237 0.47740627 2.52546902
H  4.38766447 -1.21504531 1.5613892
C  4.19574977 2.59127738 2.2794931
H  2.37130207 2.56943814 1.14613045
C  5.26473989 1.856424 2.78820744
H  6.05216886 2.30035129 3.38348541
O  6.41294921 -0.16006973 3.06448409
O  4.03283701 3.93499983 2.47362157
C  6.57585817 -1.55108278 2.81747466
H  7.50323104 -1.83441969 3.31717488
H  5.74533365 -2.13219163 3.23836547
H  6.66091621 -1.75910152 1.74394377
C  4.99844899 4.63205482 3.24990355
H  4.66682172 5.67093334 3.27384625
H  5.04615516 4.24093032 4.27403512
H  5.99462923 4.5781339 2.79267439
C  -0.35320601 2.04080848 -1.16566575
H  -0.43437284 2.52827982 -2.12939163
C  -0.15864926 0.75820052 1.35086388
C  -1.34233433 2.21335874 -0.18408856
C  -1.26562374 1.59510072 1.0719829
O  -0.17492049 0.22798183 2.61420199
C  0.54374685 -0.96563762 2.90876148
H  0.18460885 -1.28864013 3.88788673
H  0.32653269 -1.74611872 2.16982927
H  1.62202354 -0.78852434 2.96458156
C  -2.34274345 1.8335977 2.10565986
H  -3.03354376 0.98007688 2.1437027
H  -1.89472622 1.90875016 3.10055954
C  -3.11157215 3.11494673 1.77401126
H  -2.47474239 3.99027084 1.9516777
H  -3.99368538 3.21764398 2.41371114
C  -3.53943589 3.12889818 0.3002875
O  -2.3861771 3.02353607 -0.55512601
C  -4.59146247 2.0803591 -0.04609576
C  -5.86558003 2.16110144 0.54245207
C  -4.35482862 1.04288018 -0.9491239
C  -6.85924443 1.23495938 0.24715828
H  -6.09351106 2.96710985 1.23626348
C  -5.34298104 0.09762598 -1.25456765
H  -3.38732341 0.96077466 -1.43111434
C  -6.60251483 0.19242406 -0.65620043
H  -7.84469284 1.30590333 0.69649576
H  -5.10826286 -0.70632833 -1.94079789
O  -7.65285789 -0.66024949 -0.88556903
C  -7.53582391 -1.67760017 -1.88443866
H  -8.57521442 -1.96017878 -2.08224958
H  -7.1253339 -1.25588345 -2.81128242
C  -6.73548241 -2.88855892 -1.4487166
C  -5.92559623 -3.57216122 -2.35658559
C  -6.83400786 -3.38751521 -0.13928607
C  -5.2279426 -4.73038377 -1.99032681
H  -5.82535274 -3.20317096 -3.37525161
C  -6.14200726 -4.52941423 0.24493904
H  -7.45145572 -2.86456635 0.58495746
C  -5.33546315 -5.21117858 -0.68065824
H  -4.60763886 -5.23089871 -2.72420202
H  -6.21058303 -4.91436949 1.25733681
O  -4.69728186 -6.32431707 -0.20711304
C  -3.87119152 -7.06330058 -1.09750575
H  -3.03741715 -6.4540712 -1.46902282
H  -3.47791516 -7.89764153 -0.51540191
H  -4.44612838 -7.45206147 -1.94757894
H  -3.9452999 4.11714594 0.05512624
