program: Gaussian 16
title: NMR project
version: ES64L-G16RevC.01
method: RB3LYP
basis: 6-31+G(d,p)
operation: Freq
keyword: #N
keyword: Geom=AllCheck
keyword: Guess=TCheck
keyword: SCRF=Check
keyword: GenChk
keyword: RB3LYP/6-31+G(d,p)
keyword: Freq
converged: YES YES NO YES
title: Mulliken charges:
elementType: C C C C C C H H H H O C H H H C C H C H C O C C C C H C H C H O O C H H H C H H H C H C C C O C H H H C H H C H H C O C C C C H C H C H H O C H H C C C C H C H C H H O C H H H H
charge: 0.204573 -0.289928 0.203247 -0.044369 -0.045725 -0.063881 0.116216 0.131412 0.108517 0.129941 -0.336677 -0.148273 0.145459 0.148288 0.144991 -0.164789 -0.072445 0.125105 0.643232 0.127150 -0.635985 -0.206365 0.558386 0.076476 -0.412043 -0.625048 0.096370 -0.167964 0.140055 0.225720 0.125377 -0.308945 -0.337614 -0.140023 0.139930 0.154103 0.145733 -0.123093 0.143195 0.147295 0.144381 -0.433669 0.134367 0.142594 -0.056683 0.175385 -0.282226 -0.044704 0.138852 0.140167 0.159175 -0.389514 0.161411 0.160530 -0.575904 0.138073 0.153756 0.118162 -0.274509 0.358816 -0.166679 -0.120283 0.043493 0.131684 -0.286399 0.115603 -0.368203 0.120991 0.129388 -0.276072 -0.147654 0.158369 0.131637 0.284603 -0.218742 -0.386821 -0.012953 0.112526 0.411905 0.131755 -0.255161 0.132930 0.117922 -0.354857 -0.129466 0.149399 0.144440 0.144598 0.135987
chargesum: -0.00000
title: Mulliken charges with hydrogens summed into heavy atoms:
elementType: C C C C C C O C C C C C O C C C C C C O O C C C C C C O C C C C O C C C C C C O C C C C C C C O C
charge: 0.320789 -0.158516 0.203247 0.064147 0.084215 -0.063881 -0.336677 0.290466 -0.039684 0.054705 0.643232 -0.635985 -0.206365 0.558386 0.172846 -0.271988 -0.625048 -0.167964 0.351097 -0.308945 -0.337614 0.299743 0.311778 -0.299302 0.142594 -0.056683 0.175385 -0.282226 0.393490 -0.067573 -0.284075 0.254149 -0.274509 0.358816 -0.034995 -0.004680 0.164484 -0.157010 -0.368203 -0.276072 0.142352 0.284603 -0.106216 -0.255065 0.119977 0.529827 -0.255161 -0.354857 0.308971
1716.lowfreq: -2.4333 -1.7719 -1.0940 -0.0011 -0.0003 0.0009 4.1852 6.5600 14.1418
frequency: 3.9621 6.5234 14.1393 17.5033 18.7704 23.2327 24.6480 28.7051 32.7291 39.2955 48.3881 52.4313 66.8210 76.3666 82.9300 86.8804 91.5685 103.5340 112.5637 122.1251 133.3575 143.9604 148.0880 161.4109 171.8579 184.5800 187.9249 191.6408 199.0666 208.1035 220.7102 229.0085 234.8236 239.8162 245.6645 250.7492 255.4455 274.6404 278.0804 279.0869 285.8457 292.1662 297.8628 305.6680 319.2068 321.8320 340.0293 348.2403 352.7125 373.0987 404.2761 422.3183 423.8869 424.4425 424.9597 431.2506 438.3390 463.6734 479.5707 487.2006 504.5272 514.0328 521.1553 529.6858 534.9001 543.4889 547.9408 548.7039 556.7043 568.9574 592.8718 595.2908 624.9576 627.1761 629.8541 640.7137 643.4742 645.6378 654.3037 656.7537 680.3635 696.8220 700.6553 709.6596 720.4315 727.4537 739.7682 757.9819 768.7182 789.7183 792.0202 813.1865 820.4656 822.4477 824.2159 826.2312 829.9925 831.1438 836.0137 840.8018 845.2026 847.7649 850.0125 858.5764 868.2608 886.1132 913.4462 929.2958 945.3656 948.8728 951.4400 953.7886 957.2040 968.1022 969.3068 970.7463 976.0918 994.3224 1006.5103 1013.1910 1023.3048 1024.8749 1027.0048 1028.8115 1032.8650 1043.7399 1051.9428 1066.8881 1067.7101 1085.0029 1089.0003 1096.7277 1126.7969 1136.9932 1137.5377 1142.2282 1156.8079 1169.0210 1171.8997 1171.9809 1172.0905 1172.2348 1172.3541 1180.0317 1185.8337 1189.0016 1195.6918 1198.1905 1202.1847 1205.3798 1205.8631 1206.9377 1210.3909 1217.0441 1222.4514 1226.4048 1233.0019 1237.8695 1250.4277 1256.3378 1262.5252 1273.2522 1285.5080 1286.0256 1297.6665 1300.4172 1318.1486 1321.2388 1329.6434 1333.4034 1333.8306 1338.0286 1343.2585 1344.2792 1354.2255 1354.7937 1361.1881 1379.5327 1383.5961 1391.5856 1394.6771 1405.1613 1417.9346 1449.5121 1454.9258 1456.0990 1461.8510 1466.9215 1480.1150 1480.3210 1481.1317 1482.6904 1490.0289 1493.3196 1496.5664 1496.8638 1497.3580 1497.6110 1497.6567 1499.7110 1499.9944 1500.7610 1502.4656 1509.4801 1509.6722 1511.2070 1516.0183 1519.0623 1546.6841 1551.2340 1553.0404 1623.9008 1625.8411 1625.9560 1630.3950 1638.1763 1650.0229 1660.7081 1661.6613 1662.4644 1663.5951 3005.9694 3015.7582 3015.9416 3016.6916 3016.9442 3024.8247 3028.1035 3030.7453 3042.9393 3057.0473 3078.5095 3078.9552 3080.0437 3081.5227 3081.7228 3082.0028 3093.4212 3097.1193 3107.4487 3137.1259 3148.2380 3149.4851 3149.7453 3150.5185 3167.9039 3168.4749 3168.6517 3195.4088 3205.3899 3206.8888 3208.6377 3210.7762 3215.0674 3216.2118 3220.4735 3221.9166 3225.7372 3231.5857 3232.4143 3235.7765
redmass: 5.6346 6.2843 4.9269 4.9501 5.5807 3.9865 5.1893 4.6457 5.2014 3.9855 3.9818 3.9416 3.4456 3.6261 3.5918 3.6758 3.4541 5.0392 5.5663 5.0597 4.8234 4.2697 4.5412 4.1632 4.7345 4.3328 5.6140 2.6254 3.4449 1.6463 2.0240 2.7413 1.9265 2.3895 1.3617 1.2375 2.6844 1.8244 2.1583 2.8313 3.3989 5.1309 3.9316 4.1252 4.0169 3.9867 4.0766 4.4057 2.7976 4.4216 4.6750 3.3739 3.1255 3.5265 3.5352 5.9038 4.6039 4.9355 4.6928 5.0185 3.9938 3.4115 3.2453 3.8917 4.5892 3.8760 5.1605 3.5051 4.1321 4.8093 5.5463 4.6789 4.3169 4.2175 5.3082 4.9763 5.2035 6.5961 6.0826 6.4780 4.6682 2.3787 3.6472 3.5530 3.6032 4.0516 5.0186 4.3537 3.9083 2.9272 4.3407 2.6387 2.0478 1.5279 1.3921 1.3587 1.8110 1.6397 1.8760 1.6974 2.5901 3.3599 2.0826 2.5019 3.4953 1.9224 2.5403 3.3430 2.9909 1.3251 1.9456 1.4613 2.3220 1.3552 1.3521 1.3376 3.0348 4.7533 6.0531 4.7428 2.5342 2.9203 3.9273 3.0735 1.9738 2.1612 4.1181 6.0356 5.9060 3.4421 3.1575 2.1925 3.2651 1.3807 1.3581 1.4099 3.3117 1.8797 1.2721 1.2727 1.2868 1.2720 1.2793 1.8347 1.5560 1.6560 1.1872 1.1709 1.3114 1.4353 1.4063 1.4601 1.4178 1.4717 2.5905 1.8035 1.9124 1.9926 2.1135 2.2973 2.0618 1.5244 4.0657 4.2691 1.6961 1.9549 1.5091 2.1964 2.1357 1.4666 1.3778 1.8818 3.3590 2.3426 2.6686 2.8674 1.6707 2.1400 1.4638 2.9700 2.3306 1.5347 2.8322 2.8705 2.8758 2.6689 2.5623 1.4486 1.1874 1.1940 1.3685 1.4033 1.5441 1.3026 1.0476 1.0481 1.4947 1.0523 1.0485 1.4741 1.5115 1.5827 1.0956 1.0576 1.0590 1.1045 1.3972 1.0847 2.4977 2.4899 2.5739 6.6248 6.7185 6.6063 8.9691 5.9805 6.4812 7.1950 6.2984 5.7928 6.4638 1.0850 1.0342 1.0343 1.0342 1.0345 1.0711 1.0346 1.0626 1.0673 1.0813 1.1062 1.1063 1.1063 1.1027 1.0872 1.1017 1.0914 1.1021 1.1035 1.1032 1.1001 1.0998 1.0999 1.0997 1.0889 1.0884 1.0890 1.0889 1.0930 1.0928 1.0930 1.0880 1.0881 1.0894 1.0908 1.0920 1.0935 1.0929 1.0925 1.0904
irintensity: 0.0490 0.0554 0.2584 0.2977 0.0055 0.7538 0.2009 0.1869 0.5242 0.9351 0.5532 1.8761 1.3500 6.0715 5.5165 0.8883 0.1433 1.2632 3.6418 2.1275 0.7581 1.6035 1.8325 1.1271 3.5210 1.2275 2.1890 0.1733 0.1260 0.7732 0.8224 1.0498 0.8031 1.1939 0.3159 1.2322 0.6765 0.9296 0.1671 0.8475 0.1400 0.9735 2.1573 1.6331 0.8429 2.5504 2.9839 0.7135 7.6735 4.7553 2.0743 0.3932 0.2680 0.8847 0.8024 0.1892 1.0465 2.6035 9.9282 0.5808 4.8404 6.7776 10.8118 6.6115 29.8531 17.3894 4.7511 6.0003 6.9307 6.6764 5.3345 20.0646 1.4101 6.1448 5.6797 3.0072 5.8195 0.9354 3.6731 2.3318 0.8064 7.9742 1.7822 5.7754 0.2339 1.4012 6.4672 10.5613 25.0630 11.2456 11.2703 1.9129 13.0354 24.2960 16.4426 7.4528 12.0923 53.6641 36.6563 31.6875 4.0432 16.7430 19.2932 28.6757 4.1567 15.7365 0.3792 2.1246 5.9082 1.8615 7.1085 4.8682 7.8973 1.5356 0.7658 0.5279 63.6288 3.6453 1.7362 67.5128 5.8429 4.1516 11.4606 1.4439 3.2655 18.8485 79.1805 46.0992 49.1401 35.4807 54.6782 48.9943 116.0593 43.9840 1.8515 25.5750 452.0882 106.8365 0.8203 0.3186 8.2081 0.8190 5.0306 27.9115 90.2994 145.0057 61.1436 24.3135 52.0961 17.4191 18.3129 12.3124 2.2982 7.3860 5.5477 5.7881 139.9610 103.5834 246.5982 33.4256 78.7780 19.1350 254.4782 222.7580 111.7301 51.1065 15.2471 89.4381 37.9373 22.2077 3.0738 28.1690 33.8510 40.8408 14.6815 67.5943 50.3960 37.3636 4.8730 60.3352 32.9319 4.6858 39.3810 23.2287 35.1004 7.2652 56.4403 36.8709 6.7654 14.0862 7.7320 13.9523 72.1660 29.0933 9.4533 4.7566 73.9710 12.3420 7.6711 13.9975 27.4613 67.7228 6.6998 32.5708 30.4413 23.6581 5.7602 20.2728 166.4353 97.4982 121.1473 29.3206 16.1703 29.4809 113.7746 220.9589 170.1212 213.2860 219.0167 76.4431 25.3333 34.9632 56.4274 57.8493 64.0301 53.1623 22.3595 47.1093 46.4158 14.8581 56.8419 35.1571 41.1407 38.2719 26.8873 28.5346 20.5165 21.1411 40.6444 22.9705 23.8751 25.7044 21.4324 26.0660 21.8113 12.6958 16.1116 12.5281 4.1324 10.4928 9.0632 5.3425 4.8104 2.9385 5.5685 0.6229 7.9832 5.6633 6.5265 0.1616 2.1689
temp: 298.150 k
press: 1.00000 atm
elementType: 6 6 6 6 6 6 1 1 1 1 8 6 1 1 1 6 6 1 6 1 6 8 6 6 6 6 1 6 1 6 1 8 8 6 1 1 1 6 1 1 1 6 1 6 6 6 8 6 1 1 1 6 1 1 6 1 1 6 8 6 6 6 6 1 6 1 6 1 1 8 6 1 1 6 6 6 6 1 6 1 6 1 1 8 6 1 1 1 1
symmnumber: 1
zpe: 1908274.0 jmol-1
zpe.correction: 0.726823 hartree
zpe.thermalcorrener: 0.771239 hartree
zpe.thermalcorrenthalpy: 0.772183 hartree
zpe.thermalcorrgfe: 0.641114 hartree
zpe.sumelectzpe: -2187.574242 hartree
zpe.sumelectthermal: -2187.529826 hartree
zpe.sumelectthermalent: -2187.528882 hartree
zpe.sumelectthermalfe: -2187.659951 hartree
dipole: -2.4698 -0.0912 -3.8401
dipole: 4.5666
quadrupole: -264.2365 -269.3675 -271.8391
quadrupole: -10.4062 -8.6029 12.1525
quadrupole: 4.2446 -0.8865 -3.3580 -10.4062 -8.6029 12.1525
hfenergy: -2188.301065 hartree
pointgroup: C01[X(C41H40O8)]
dipole: -0.9716802 -0.035886 -1.5108046 debye
polarizability: 618.6901501|4.7312449|486.7260179|1.1217022|25.576107|434.6672616 unknown
InChI: InChI=1/41C.8O.40H
charge 0 multiplicity 1
89 atoms
C  -5.85190568 0.9915932 2.92577134
C  -4.52419205 0.9286485 2.4921278
C  -4.06326002 -0.14122541 1.72075714
C  -4.9673474 -1.16551598 1.39948307
C  -6.29462458 -1.11430342 1.81258239
C  -6.74568995 -0.02954775 2.57866733
H  -6.17117143 1.83485872 3.52653216
H  -3.83725221 1.72115599 2.76802878
H  -4.62681012 -2.02249768 0.82220123
H  -6.99288182 -1.90830154 1.56798172
O  -8.06379517 -0.06531208 2.94388268
C  -8.57833588 0.99937729 3.7340755
H  -8.50055908 1.96057337 3.21056622
H  -9.62982312 0.76314406 3.90243312
H  -8.06170678 1.06692042 4.69975377
C  -2.64740241 -0.21354643 1.21759578
C  -2.28175479 0.53505437 -0.12546715
H  -2.37821401 -1.26841758 1.06256621
C  -0.80876858 0.81414262 0.14504006
H  -2.44141328 -0.18446851 -0.93283873
C  -0.60620183 0.71404292 1.53141184
O  -1.72800818 0.30962918 2.20569386
C  -3.12111082 1.7722176 -0.43593826
C  -4.29821051 1.61151936 -1.19411548
C  -2.76257379 3.03294892 0.02814054
C  -5.10151173 2.71971411 -1.46427748
H  -4.57328355 0.62396131 -1.54458104
C  -3.57829789 4.14319537 -0.25434063
H  -1.85514871 3.1872372 0.60050803
C  -4.74727534 3.9973263 -0.99848035
H  -5.39785164 4.82818991 -1.23908157
O  -6.26496798 2.67391637 -2.18447642
O  -3.13697172 5.33655553 0.24672054
C  -6.72007514 1.41344691 -2.66061568
H  -6.00558456 0.97059376 -3.36630983
H  -6.8988174 0.71490518 -1.83415286
H  -7.65976994 1.6133008 -3.17736347
C  -3.90278329 6.50653382 -0.00925564
H  -4.91026005 6.42726482 0.41857388
H  -3.36714576 7.3242077 0.47481728
H  -3.97888465 6.70720224 -1.08538746
C  0.5812245 1.02071311 2.16803075
H  0.70896401 0.92186271 3.23893594
C  0.26344573 1.26493007 -0.63464435
C  1.63500501 1.4655701 1.35371916
C  1.50081567 1.60175969 -0.0354101
O  0.23870964 1.45880767 -1.99114964
C  -0.69241362 0.75481101 -2.80670633
H  -0.35675915 0.91032126 -3.83397738
H  -0.67806288 -0.31816879 -2.5810595
H  -1.70741276 1.1489652 -2.69951978
C  2.65753696 2.11077207 -0.86512673
H  3.16786841 1.27632861 -1.36576626
H  2.28722406 2.76412213 -1.66018687
C  3.64492257 2.86907999 0.02535644
H  4.56242685 3.10644053 -0.52235618
H  3.20187483 3.81842232 0.35070241
C  3.99278178 2.05082654 1.27647489
O  2.80050111 1.74355336 2.0225176
C  4.80961767 0.7974292 0.98305523
C  4.31403338 -0.49269518 1.17747734
C  6.12666742 0.93145366 0.51056099
C  5.09051882 -1.62512388 0.8984561
H  3.30741 -0.63102734 1.5553676
C  6.91310227 -0.18091655 0.23387414
H  6.5528498 1.9218184 0.36595155
C  6.39711755 -1.47146164 0.42646886
H  4.65771515 -2.60763933 1.0395944
H  7.93336091 -0.07370656 -0.12061516
O  7.25820517 -2.49975982 0.13574596
C  6.86473937 -3.84860182 0.40115537
H  7.8131699 -4.39622073 0.4018118
H  6.43678026 -3.92951447 1.40897785
C  5.91869699 -4.43364197 -0.62901665
C  4.94395518 -5.36963715 -0.25126247
C  6.0272289 -4.10197814 -1.98149294
C  4.10834647 -5.96112144 -1.19348122
H  4.83237803 -5.64052937 0.79652946
C  5.18947662 -4.67884503 -2.94183852
H  6.768777 -3.37240685 -2.29317522
C  4.22608027 -5.61646365 -2.54787716
H  3.35257589 -6.683224 -0.90189484
H  5.29839526 -4.39058301 -3.98063859
O  3.35790095 -6.24235116 -3.39978024
C  3.42862499 -5.93693301 -4.78674761
H  2.65825119 -6.54359484 -5.26439086
H  3.22383489 -4.87524599 -4.97409072
H  4.4087523 -6.19877958 -5.20501879
H  4.56724752 2.68013217 1.96586009
