program: Gaussian 16
title: NMR project
version: ES64L-G16RevC.01
method: RB3LYP
basis: 6-31+G(d,p)
operation: Freq
keyword: #N
keyword: Geom=AllCheck
keyword: Guess=TCheck
keyword: SCRF=Check
keyword: GenChk
keyword: RB3LYP/6-31+G(d,p)
keyword: Freq
converged: YES YES NO YES
title: Mulliken charges:
elementType: C C C C C C H H H H O C H H H C C H C H C O C C C C H C H C H O O C H H H C H H H C H C C C O C H H H C H H C H H C O C C C C H C H C H H O C H H C C C C H C H C H H O C H H H H
charge: -0.085743 0.188272 0.310764 -0.376596 0.051111 -0.033729 0.129202 0.132884 0.105993 0.115259 -0.329313 -0.144901 0.145023 0.143352 0.147757 -0.422059 0.248009 0.127279 0.548837 0.143191 -0.759226 -0.200635 0.408026 -0.275161 0.175011 0.130652 0.116166 -0.773560 0.106509 0.233182 0.124845 -0.343611 -0.286229 -0.130679 0.144664 0.145248 0.144248 -0.098058 0.143236 0.155552 0.149466 -0.247421 0.134910 0.078950 -0.571046 0.250652 -0.237571 -0.047042 0.144263 0.140476 0.137768 -0.357588 0.161342 0.163117 -0.663723 0.139648 0.153248 0.097568 -0.276190 0.698479 -0.335505 -0.123156 -0.278640 0.129815 -0.038583 0.116009 -0.341771 0.122031 0.129982 -0.278930 -0.151739 0.158736 0.131599 0.269507 -0.210228 -0.368983 -0.028041 0.112706 0.408925 0.131441 -0.260067 0.133565 0.118330 -0.350286 -0.127996 0.144646 0.150244 0.144669 0.137648
chargesum: -0.00000
title: Mulliken charges with hydrogens summed into heavy atoms:
elementType: C C C C C C O C C C C C O C C C C C C O O C C C C C C O C C C C O C C C C C C O C C C C C C C O C
charge: 0.043459 0.321156 0.310764 -0.270603 0.166370 -0.033729 -0.329313 0.291230 -0.294780 0.391200 0.548837 -0.759226 -0.200635 0.408026 -0.158995 0.281520 0.130652 -0.773560 0.358028 -0.343611 -0.286229 0.303482 0.350196 -0.112512 0.078950 -0.571046 0.250652 -0.237571 0.375465 -0.033129 -0.370828 0.235215 -0.276190 0.698479 -0.205690 -0.007147 -0.156610 0.091399 -0.341771 -0.278930 0.138596 0.269507 -0.097522 -0.237542 0.105523 0.527254 -0.260067 -0.350286 0.311564
chargesum: 0.00000
1716.lowfreq: -3.2443 -1.0982 -0.0011 -0.0008 -0.0005 1.0923 4.9864 5.8739 12.2867
frequency: 4.9635 5.8610 12.2760 15.5603 19.1118 20.8710 24.9923 26.5034 31.5460 41.8475 47.4369 51.5734 62.0073 72.7983 81.8291 85.5375 92.7811 94.5137 110.4840 118.8693 132.0784 144.5817 150.6844 155.5102 161.5187 164.3793 179.5018 192.5370 194.1053 208.4458 212.9648 222.0811 227.1128 235.6072 245.5533 248.2863 255.4967 275.2261 277.4294 279.5596 283.2374 289.2803 295.6295 304.4632 321.6343 325.7836 343.7777 347.7787 351.5399 360.9852 399.9737 422.2354 423.0631 423.4472 431.2166 434.2667 442.1145 451.8152 464.7631 481.2236 498.1238 513.8576 519.6029 525.1825 530.4940 544.0976 546.1686 551.5652 553.5697 591.0330 594.9510 604.3227 623.6587 628.4086 633.2105 644.8204 647.6726 650.2517 653.8934 660.8039 690.3335 697.1954 705.9261 712.0715 718.5360 722.3007 735.6206 742.9164 758.3318 771.2801 789.2484 809.3216 817.4441 818.9174 823.7550 825.6581 829.0857 836.3147 838.7254 839.4756 845.7534 847.9815 849.5778 854.6773 861.5551 888.7353 912.9662 927.5426 945.8775 948.6251 949.3375 952.0950 957.7926 967.8599 970.6689 974.2160 984.9348 992.0600 1004.5337 1010.4756 1021.2286 1023.1257 1024.8475 1031.5488 1035.7842 1044.5943 1051.0031 1067.4364 1067.9884 1080.9480 1088.6964 1095.0830 1106.8006 1137.0973 1139.0556 1140.8034 1147.6070 1170.2400 1171.8808 1171.9148 1171.9750 1172.2829 1172.9468 1179.7200 1185.6101 1191.4428 1195.9469 1200.9171 1201.6848 1205.2147 1205.5731 1205.7914 1210.7074 1211.4462 1222.2048 1222.7769 1233.1613 1238.0978 1250.9095 1254.4338 1261.2114 1280.8669 1285.6357 1286.5966 1292.2991 1297.5112 1319.6047 1321.7288 1332.6277 1333.6510 1334.0272 1340.6841 1342.6250 1345.2402 1348.1585 1354.3676 1355.8004 1374.7625 1382.6371 1385.4997 1394.0499 1405.1326 1411.7376 1450.0065 1455.6489 1456.2139 1459.9630 1469.3200 1479.8186 1480.1688 1481.5437 1483.6611 1489.4176 1490.9677 1496.1071 1497.0433 1497.3632 1497.7071 1498.6609 1499.5978 1500.2545 1502.2758 1504.1811 1505.9618 1509.3003 1509.6171 1512.9376 1516.4879 1546.6514 1551.3615 1551.6100 1623.6429 1625.6622 1625.7133 1632.1185 1642.3383 1649.7221 1657.6820 1661.3010 1661.8939 1662.3851 3005.7826 3015.0142 3016.1763 3016.2747 3023.0082 3023.7160 3025.6893 3031.3082 3042.7502 3057.4363 3077.7365 3079.0777 3079.2875 3082.7716 3086.8372 3089.6271 3095.7476 3098.2423 3098.2674 3140.9379 3148.2756 3148.4498 3149.1161 3151.2017 3168.5026 3168.8441 3177.8241 3193.3592 3194.9140 3198.8686 3205.8477 3208.9759 3214.4834 3215.3043 3221.5778 3221.9740 3228.5498 3231.6081 3235.5397 3241.9025
redmass: 5.7393 6.2511 5.2264 4.9902 4.9056 5.2911 4.0792 4.8003 5.5363 3.7722 3.7697 4.1205 2.2668 3.5921 3.7228 3.4625 3.4177 3.7609 4.5744 4.8695 3.5889 2.7399 4.8454 2.0694 4.1424 4.3181 4.1301 3.2026 3.0468 1.8141 3.0771 1.9366 4.5009 1.4230 1.7314 2.2368 3.5356 1.8634 2.8435 2.4178 3.3362 4.6059 4.2946 3.6486 4.6193 4.4284 4.7022 3.8423 3.0798 3.9313 4.4135 3.1238 3.1004 3.0594 4.8870 4.8961 5.0188 5.2515 5.2617 5.1855 4.1293 3.3003 3.5730 4.5456 3.7362 3.2360 5.3007 3.6148 3.8189 6.6494 4.6807 5.0616 4.3505 4.8254 4.3988 6.8065 5.6519 4.6258 6.2488 5.0057 3.7459 3.0674 3.2239 3.3059 3.6486 4.2497 5.0099 5.2421 4.3545 4.9761 2.8922 2.7751 3.5441 1.6314 1.3558 1.3682 2.0507 1.8521 1.5375 1.5546 1.7796 2.9498 2.1012 2.1231 1.7444 3.6188 2.5247 3.3401 1.4535 1.3638 3.2472 1.6006 3.1107 1.3428 1.3372 1.3567 6.0468 3.7989 5.0598 4.3631 3.5974 2.5293 2.9211 2.0483 2.8559 2.4673 3.8839 5.9338 5.9622 3.2216 3.1969 2.2569 4.1118 1.4468 1.7315 1.3249 2.0419 1.6829 1.2802 1.2728 1.2760 1.2723 1.2717 1.7113 1.6402 1.5696 1.1881 1.3736 1.2295 1.4228 1.4315 1.3710 1.4324 1.4323 2.3785 2.5875 2.0010 2.3166 2.0945 1.3513 1.8599 1.6228 3.4030 4.2734 2.0698 1.7038 1.5346 1.6600 2.0978 1.7272 1.5244 1.8440 2.5138 2.8228 2.9134 2.7353 1.9433 2.4812 1.4522 2.8875 2.4338 1.5363 2.4833 2.8565 2.7890 2.6724 2.7166 1.3424 1.1831 1.1877 1.4319 1.3335 1.2441 1.4471 1.0465 1.0488 1.0482 1.0473 1.6131 1.4273 1.4979 1.0957 1.8309 1.0625 1.0579 1.0598 1.1956 1.3807 2.5003 2.4905 2.4853 6.6145 6.5598 6.6075 9.2088 6.0751 6.5927 8.9518 5.8568 5.9056 5.7875 1.0835 1.0343 1.0343 1.0341 1.0333 1.0518 1.0543 1.0627 1.0669 1.0820 1.1062 1.1062 1.1063 1.1017 1.0874 1.1066 1.0928 1.1006 1.1015 1.1025 1.1000 1.1009 1.0997 1.0997 1.0885 1.0890 1.0893 1.0907 1.0890 1.0881 1.0930 1.0930 1.0882 1.0941 1.0915 1.0920 1.0923 1.0928 1.0904 1.0900
irintensity: 0.0589 0.0175 0.3743 0.2478 0.0199 0.0101 0.7400 0.5509 0.1565 1.6704 0.0507 1.0770 5.1495 4.7441 3.2391 2.9165 0.4233 0.0202 1.9371 4.7126 0.6489 1.5517 1.2544 1.0685 0.7451 0.8203 2.4796 1.9041 1.1224 0.4487 0.1280 0.3869 5.3039 0.5989 0.7145 0.6614 0.3742 1.0337 0.6692 0.1271 0.8125 5.1171 2.8574 1.2537 2.8690 1.2608 0.2461 3.6822 8.4200 1.9231 2.5805 0.9359 0.6136 0.6647 1.5729 5.2480 0.4822 2.6440 1.6245 3.1794 4.1447 7.6495 17.5112 9.0057 3.7612 4.7226 6.2522 13.4496 18.3160 2.8753 14.0335 12.8497 0.6880 11.3079 0.2927 2.5823 1.8678 3.3110 0.7395 2.3036 4.3064 3.5333 3.5190 11.4944 1.6821 1.5367 8.6088 14.2987 10.6752 16.8638 15.1244 13.1066 16.9369 21.5116 6.2480 17.6993 33.1225 57.0909 15.9934 22.8170 7.3152 13.4612 28.1506 13.9832 10.9905 17.8426 2.1358 16.8867 0.8426 0.2730 9.3440 3.2696 10.0287 0.1649 0.3204 0.3799 29.1477 8.6972 18.3573 8.2516 36.8743 1.9400 4.4556 5.2859 22.0883 46.6829 82.5325 50.0367 51.7557 35.1646 36.4499 57.3838 175.5918 60.1071 120.0480 8.0857 194.9151 124.0881 7.3754 0.9664 0.2214 0.8624 2.3013 9.6887 272.9768 52.4393 59.3849 16.2366 54.0577 23.8697 8.2466 17.2490 0.8259 9.3338 16.2003 2.8049 167.3798 58.2273 258.6194 8.4365 80.8624 15.7192 236.1206 217.1935 21.8390 119.8991 25.4956 9.8642 46.7762 56.0301 3.4144 5.8530 49.3586 51.2879 4.1517 90.7181 16.0248 33.0813 6.4078 98.1856 33.1017 5.1083 25.3130 12.2377 17.3158 6.8364 55.2890 43.9015 7.5376 6.7964 12.3718 16.6110 28.2133 53.4669 9.0077 9.8942 4.0426 7.2399 83.1769 11.6148 47.4879 6.4811 69.3600 6.5236 33.3646 31.9210 20.2537 17.8405 171.0929 96.7842 121.4927 28.5726 17.7031 8.2236 102.7111 176.9130 207.7073 303.5227 92.4191 29.7041 75.0005 15.7124 59.4498 44.1360 85.6758 37.1624 16.3458 63.6768 46.7323 17.6471 54.9950 39.5696 37.9207 37.2065 19.5536 24.8246 26.3543 22.9895 5.5430 64.2485 18.8745 27.1156 20.5126 27.4604 21.0654 15.7693 12.4353 9.4859 3.7821 4.1847 4.4971 9.9965 5.1137 2.9164 4.4753 9.7610 7.8368 0.3290 6.4141 2.4267 1.6510
temp: 298.150 k
press: 1.00000 atm
elementType: 6 6 6 6 6 6 1 1 1 1 8 6 1 1 1 6 6 1 6 1 6 8 6 6 6 6 1 6 1 6 1 8 8 6 1 1 1 6 1 1 1 6 1 6 6 6 8 6 1 1 1 6 1 1 6 1 1 6 8 6 6 6 6 1 6 1 6 1 1 8 6 1 1 6 6 6 6 1 6 1 6 1 1 8 6 1 1 1 1
symmnumber: 1
zpe: 1906917.8 jmol-1
zpe.correction: 0.726307 hartree
zpe.thermalcorrener: 0.770944 hartree
zpe.thermalcorrenthalpy: 0.771889 hartree
zpe.thermalcorrgfe: 0.639910 hartree
zpe.sumelectzpe: -2187.572154 hartree
zpe.sumelectthermal: -2187.527516 hartree
zpe.sumelectthermalent: -2187.526572 hartree
zpe.sumelectthermalfe: -2187.658551 hartree
dipole: -1.6757 0.6115 -3.9322
dipole: 4.3179
quadrupole: -255.0844 -277.5113 -277.1461
quadrupole: -3.2656 -4.9994 6.4521
quadrupole: 14.8296 -7.5974 -7.2322 -3.2656 -4.9994 6.4521
hfenergy: -2188.2984607 hartree
pointgroup: C01 [X(C41H40O8)]
dipole: -0.6592739 0.240565 -1.5470655 debye
polarizability: 601.9162764|-11.698338|459.2689308|13.4214705|42.8377519|468.0711067 unknown
InChI: InChI=1/41C.8O.40H
charge 0 multiplicity 1
89 atoms
C  -4.25828091 2.25125802 3.97639868
C  -3.36370059 1.38649829 3.35555316
C  -3.81851461 0.33728037 2.54081965
C  -5.19700613 0.1747017 2.38684134
C  -6.11201408 1.03845037 2.9985867
C  -5.63987324 2.08750977 3.79574545
H  -3.90824113 3.0573873 4.61345837
H  -2.2995613 1.51835074 3.5196565
H  -5.57846068 -0.63715761 1.77266873
H  -7.17321365 0.87772817 2.85071816
O  -6.43776688 2.99086656 4.44392831
C  -7.84742591 2.87566368 4.30025152
H  -8.15333538 2.98468021 3.25199214
H  -8.21270987 1.91659944 4.68905465
H  -8.27405687 3.68945351 4.88811215
C  -2.86412552 -0.60715594 1.83865716
C  -2.37083452 -0.19078439 0.38515151
H  -3.32447797 -1.59743429 1.78897368
C  -0.97306879 0.31681751 0.69155384
H  -2.28581653 -1.12714406 -0.18405578
C  -0.63727596 -0.08843325 1.98760546
O  -1.6487606 -0.75804223 2.62079154
C  -3.32286008 0.70700223 -0.38552379
C  -4.24209365 0.11969597 -1.25205415
C  -3.30985121 2.10138812 -0.21559845
C  -5.16368817 0.9183487 -1.95094659
H  -4.26523073 -0.95490761 -1.40682137
C  -4.22693216 2.88455212 -0.91617294
H  -2.58163408 2.54698556 0.44819291
C  -5.16276928 2.3014861 -1.7892687
H  -5.84934006 2.95406617 -2.31301808
O  -6.02338374 0.24228406 -2.7748736
O  -4.29918837 4.24761572 -0.8291011
C  -6.97270594 0.99062524 -3.5232728
H  -6.47914557 1.69296146 -4.20678528
H  -7.53912334 0.25941362 -4.10164384
H  -7.65561543 1.54287033 -2.86538621
C  -3.39318666 4.92066917 0.03951781
H  -3.63489821 5.98095192 -0.04642554
H  -3.52505674 4.59842026 1.07927756
H  -2.35273735 4.75703643 -0.26630734
C  0.59164649 0.15757798 2.57573833
H  0.82668953 -0.16307417 3.5835783
C  -0.00188771 0.9849608 -0.05719862
C  1.53669571 0.85363195 1.8058186
C  1.26210463 1.28432762 0.49660867
O  -0.23560262 1.43956991 -1.3387009
C  -0.43435586 0.43988431 -2.34189939
H  -1.37433064 -0.10218472 -2.19603599
H  -0.4784719 0.97236261 -3.29400361
H  0.40344466 -0.26852993 -2.35568382
C  2.30101078 2.06178953 -0.27936138
H  2.83540819 1.40263721 -0.97729438
H  1.81304455 2.82612898 -0.89057528
C  3.29886042 2.70263649 0.68853872
H  4.14079383 3.14534962 0.14710722
H  2.81073531 3.50781223 1.25157812
C  3.82540214 1.66650561 1.69231605
O  2.73660861 1.08189687 2.43166564
C  4.71110721 0.59797016 1.0616356
C  4.34175286 -0.74597452 0.98882008
C  5.96357054 0.96491592 0.53954221
C  5.17825048 -1.70451335 0.40176942
H  3.38933423 -1.06504937 1.39677383
C  6.8084403 0.02635044 -0.04136467
H  6.29318662 2.00000911 0.59691234
C  6.41891132 -1.31981224 -0.11462238
H  4.84161559 -2.73206409 0.34408018
H  7.7795913 0.31107743 -0.43358128
O  7.33007122 -2.16565749 -0.69429128
C  7.07481476 -3.57290396 -0.71829818
H  8.06112589 -4.00791102 -0.91124089
H  6.75029815 -3.91799667 0.27209909
C  6.08857867 -4.00681427 -1.78464227
C  5.22507814 -5.08960699 -1.55899833
C  6.05173992 -3.38132191 -3.03309448
C  4.35695571 -5.53851119 -2.54928505
H  5.22769749 -5.59064904 -0.59326512
C  5.17878212 -3.81226991 -4.03759474
H  6.70557777 -2.53567168 -3.2248526
C  4.32809061 -4.89920408 -3.79736758
H  3.6871804 -6.3743409 -2.37492268
H  5.17383169 -3.29750824 -4.99104557
O  3.43882073 -5.40444777 -4.70513961
C  3.36341449 -4.80172079 -5.99100127
H  4.3200926 -4.87377149 -6.52362375
H  2.60267245 -5.36083943 -6.53708258
H  3.06194848 -3.74879811 -5.92283471
H  4.40735403 2.18244309 2.46453857
