program: Gaussian 16
title: NMR project
version: ES64L-G16RevC.01
method: RB3LYP
basis: 6-31+G(d,p)
operation: Freq
keyword: #N
keyword: Geom=AllCheck
keyword: Guess=TCheck
keyword: SCRF=Check
keyword: GenChk
keyword: RB3LYP/6-31+G(d,p)
keyword: Freq
converged: YES YES YES YES
title: Mulliken charges:
elementType: C C C C C C H H H H O C H H H C C H C H C O C C C C H C H C H O O C H H H C H H H C H C C C O C H H H C H H C H H C O C C C C H C H C H H O C H H C C C C H C H C H H O C H H H H
charge: -0.026175 -0.101481 0.708669 -0.444972 0.379767 -0.056887 0.130424 0.108919 0.126654 0.116150 -0.336201 -0.140742 0.144613 0.147529 0.148653 -0.551377 -0.116028 0.125923 0.788280 0.126964 -0.398896 -0.191425 0.661946 -0.140710 -0.254066 -0.167183 0.096906 -0.324470 0.122995 -0.243726 0.139051 -0.310006 -0.338042 -0.137017 0.146202 0.139325 0.153061 -0.107521 0.145156 0.146209 0.148398 -0.465873 0.137978 0.325849 -0.930538 0.290658 -0.270285 -0.045146 0.161780 0.141227 0.139825 -0.363488 0.159157 0.155452 -0.396825 0.156862 0.146786 0.030180 -0.248816 0.014352 -0.574345 -0.114382 -0.004964 0.114637 0.788201 0.134079 -0.530598 0.129698 0.123450 -0.277880 -0.157931 0.131884 0.158859 0.232661 -0.422509 -0.176299 0.423994 0.132528 0.004235 0.111669 -0.247774 0.118522 0.133270 -0.357216 -0.129527 0.150070 0.144026 0.145870 0.111772
chargesum: -0.00000
title: Mulliken charges with hydrogens summed into heavy atoms:
elementType: C C C C C C O C C C C C O C C C C C C O O C C C C C C O C C C C O C C C C C C O C C C C C C C O C
charge: 0.104249 0.007438 0.708669 -0.318318 0.495916 -0.056887 -0.336201 0.300053 -0.425455 0.010936 0.788280 -0.398896 -0.191425 0.661946 -0.043804 -0.131071 -0.167183 -0.324470 -0.104674 -0.310006 -0.338042 0.301571 0.332242 -0.327895 0.325849 -0.930538 0.290658 -0.270285 0.397686 -0.048878 -0.093177 0.141952 -0.248816 0.014352 -0.459709 0.019697 0.124735 0.911651 -0.530598 -0.277880 0.132812 0.232661 -0.289981 -0.064630 0.542516 0.137505 -0.247774 -0.357216 0.310438
1716.lowfreq: -1.2701 -0.1573 -0.0009 0.0006 0.0010 2.3944 5.9901 8.9894 11.8729
frequency: 5.9718 8.9889 11.8686 18.3970 22.9680 24.1722 24.9899 31.1867 35.9135 38.2297 48.3569 52.7658 69.3525 73.1841 75.9917 86.8422 98.0298 102.0882 107.9131 121.3086 122.2046 132.9273 150.5244 162.2287 165.3232 179.1131 181.9119 192.5012 200.5971 202.7312 220.0287 224.5039 229.7753 236.0859 245.5649 247.0946 254.0829 261.8579 264.8678 270.1731 283.6496 286.6017 297.9134 311.3882 318.9192 324.2427 329.3736 350.2493 361.8592 366.9958 392.7414 403.3724 423.7344 424.1796 424.5014 429.0181 447.7282 449.1773 484.1815 490.4253 492.5004 513.1853 522.0773 528.8995 538.1651 543.9400 552.7475 559.9777 572.8206 582.1534 589.1052 594.1165 596.3372 625.0536 627.0953 631.7575 643.7689 646.2958 652.5620 658.3030 683.4264 694.7202 700.6985 706.3981 728.7198 734.2678 743.2515 757.6329 767.0374 786.4555 794.2259 814.9394 821.8537 822.4286 826.0882 831.4912 833.7352 835.0149 838.0012 843.9640 847.1841 851.2292 855.3092 861.9687 870.2250 876.5685 915.1186 928.2167 938.7701 948.6236 951.8069 953.1644 957.0303 968.5876 969.7351 970.4995 982.1211 1001.7448 1006.5209 1008.3597 1024.1763 1025.7449 1027.4543 1030.2088 1034.0950 1050.9789 1060.8327 1066.5372 1067.4559 1076.7976 1084.9440 1088.4852 1127.0151 1136.7361 1137.6224 1138.7627 1154.9683 1170.7939 1172.0006 1172.0577 1172.3900 1173.5572 1179.6721 1184.1189 1188.3207 1195.7917 1196.2654 1198.7377 1199.3646 1205.6687 1206.0145 1212.0007 1214.7180 1222.1924 1223.4447 1225.0526 1230.4872 1236.2710 1243.9824 1250.6366 1256.2478 1275.5493 1286.5801 1286.9199 1298.6723 1303.5575 1316.9906 1325.3446 1332.5027 1333.2960 1335.7666 1340.2678 1342.6696 1346.0659 1351.5236 1354.0403 1360.2151 1373.7833 1378.8990 1389.2315 1395.3323 1405.3626 1411.8641 1452.9351 1456.3428 1457.2968 1463.2155 1466.6649 1479.8549 1480.2596 1480.6762 1485.6545 1488.5571 1494.2900 1497.3875 1497.4189 1497.7631 1497.8649 1497.9851 1501.0977 1501.6480 1501.9587 1502.9679 1509.0778 1509.4631 1509.8950 1517.8690 1519.4189 1549.0840 1551.6067 1553.4083 1625.2251 1625.6491 1626.1579 1629.0484 1632.4965 1651.7353 1660.0009 1661.4305 1662.7422 1663.5471 2995.2586 3007.0122 3014.9441 3016.1182 3016.7534 3017.5033 3020.6446 3029.1832 3029.3574 3044.8511 3079.2037 3080.2259 3080.3566 3081.2805 3081.3356 3085.2667 3085.4659 3095.8467 3109.7034 3139.5873 3147.9310 3148.5440 3150.4706 3151.5189 3167.7297 3168.1752 3171.1437 3196.5543 3200.6886 3207.0385 3207.2539 3208.9499 3210.9274 3215.1879 3222.6506 3223.9332 3226.0058 3229.9480 3233.0405 3235.6153
redmass: 5.7254 5.7032 5.8567 4.5400 4.9466 3.9816 5.3957 5.7156 4.9206 3.7020 3.8874 4.7695 2.9861 3.2575 3.7499 3.7675 4.7963 3.6216 4.3595 4.8445 5.1482 4.6913 5.4453 4.3282 4.0058 5.2234 3.8265 3.4586 2.8544 1.5871 2.4660 3.5347 2.0688 2.3572 1.5234 1.4097 2.3113 1.7234 2.0355 4.0293 1.8745 3.7449 3.6424 3.7422 3.6522 4.1487 4.1109 2.9890 4.4820 4.4577 6.5842 5.7980 3.0979 3.0453 3.0802 4.9706 4.7134 4.5788 4.0563 5.9927 4.2201 3.1381 3.6756 4.0514 3.5334 3.9591 4.3290 2.9383 4.2953 5.8717 4.9020 4.8299 4.6377 4.4405 4.3002 4.6225 5.7998 6.4303 6.3724 6.0093 5.9266 2.7442 3.2951 3.4886 3.9889 4.1181 4.9338 4.3677 3.8952 3.8573 4.3214 2.7110 1.4212 1.4124 1.2980 1.9506 1.7104 1.5614 1.9654 1.7968 3.0092 2.2470 2.3152 1.6540 2.9542 3.5101 2.6212 3.4499 4.7774 1.2959 1.5161 1.3711 2.6807 1.3433 1.3471 1.3372 3.0989 5.0329 5.8717 3.9733 2.5544 2.8240 2.9916 4.0032 1.9768 5.3312 3.0227 6.0122 5.8191 5.9406 2.4673 1.8314 3.7529 1.3236 1.4080 1.3174 4.2009 1.2715 1.2719 1.2711 1.2718 1.2746 1.6488 1.6336 2.0197 1.1909 1.3324 1.1735 1.2057 1.4258 1.4041 1.4830 1.6014 2.6417 2.0559 1.8304 1.8192 1.9127 1.5037 2.1816 2.6643 1.4746 4.0814 4.2579 1.7248 1.7233 1.5657 1.9047 1.4188 1.4716 1.9697 1.8212 2.2596 3.3107 3.0690 2.9625 2.1688 1.5512 3.8015 2.2070 1.8717 1.5376 3.0151 2.9653 2.6668 2.7321 2.4206 1.4891 1.3314 1.1888 1.1962 1.2465 1.6156 1.3249 1.0635 1.3434 1.0907 1.0479 1.0464 1.5145 1.4716 1.0972 1.7245 1.0511 1.0578 1.0594 1.5004 1.1045 2.5673 2.5119 2.5746 6.6650 6.8324 6.6615 8.7540 5.9548 6.4354 8.2113 6.0181 5.7964 6.1080 1.0837 1.0850 1.0726 1.0346 1.0343 1.0342 1.0338 1.0618 1.0355 1.0624 1.0896 1.1063 1.1057 1.1013 1.1064 1.1063 1.0843 1.1035 1.1035 1.1034 1.0999 1.1005 1.0999 1.0998 1.0890 1.0890 1.0889 1.0889 1.0892 1.0931 1.0928 1.0930 1.0880 1.0894 1.0921 1.0917 1.0935 1.0921 1.0925 1.0894
irintensity: 0.1037 0.0678 0.0288 0.0162 0.4946 0.9263 0.2031 0.1294 0.5211 1.6644 0.5112 0.7213 7.6373 1.7944 2.0583 1.2488 4.6364 0.0366 1.6515 1.8955 2.3730 1.0696 0.3430 2.6049 0.4505 2.1366 1.9721 1.6429 1.0645 0.3040 0.5340 0.3951 0.9475 1.8689 0.4256 1.1238 4.6852 0.6726 0.8548 1.2423 0.1636 0.5155 1.2589 0.9123 1.0766 0.6328 3.8549 6.8643 1.9109 0.5612 1.9295 0.6986 0.8642 0.2949 1.4400 1.5284 2.6363 3.4916 1.0852 0.0747 0.7895 8.9410 11.7735 8.9797 28.8821 0.6719 4.0601 9.0783 9.7547 44.4593 18.3825 5.4380 21.5326 1.6293 4.1763 3.8301 0.7601 1.1702 3.9931 1.9472 0.5638 3.2276 3.0563 6.9302 2.4882 0.3954 5.9017 11.8048 28.2377 0.6164 13.1644 15.4244 4.3546 15.8582 9.0696 8.1573 25.8570 35.0142 49.8406 1.2479 27.8380 8.5052 16.5324 41.8775 6.8966 15.6584 4.2298 8.3012 9.1085 2.4466 1.2210 2.1718 36.4720 0.4216 0.8909 0.2798 44.1195 3.1332 6.8737 50.5635 9.7694 3.4680 9.2690 29.7022 1.7059 104.9810 8.0684 53.8909 47.1492 5.3197 43.5274 40.6578 108.7444 24.8977 24.0752 1.5093 612.7569 0.5948 0.9612 0.4182 0.9722 16.7588 172.3653 6.1314 238.9638 73.4793 62.0186 32.7611 49.8364 12.2400 12.4327 7.0105 18.0762 7.1414 269.2773 6.3334 6.2165 19.1889 16.3118 296.9379 39.4544 32.4314 198.7579 318.5023 127.8825 29.8842 35.9568 6.5498 17.7977 1.6530 16.2197 3.3251 52.8242 95.0591 77.2441 75.8733 13.2881 32.8285 17.8733 19.0694 35.9443 6.0913 55.9138 70.0277 10.2364 24.5048 69.3924 43.9262 25.5155 10.2017 2.7138 1.1060 63.1247 34.8117 5.1170 70.7688 14.2869 11.8835 5.6308 19.6356 12.4445 6.5578 41.9328 47.4484 32.7767 45.7812 1.2259 25.9999 202.8699 86.0286 121.8514 32.0780 22.7161 23.7978 99.4890 140.5608 178.6750 514.9379 17.7750 85.7322 24.7430 21.2392 35.9983 33.8593 52.7311 56.5593 60.1337 43.3861 43.5426 55.6277 27.1845 21.5170 37.8760 39.5766 21.3586 29.4808 29.0338 30.1298 27.7377 20.9087 23.4668 26.9102 24.9901 26.2343 22.4350 13.4693 12.7777 15.5087 4.5621 7.9341 7.2263 9.3156 5.7221 4.9194 5.6274 8.1090 0.6764 5.3773 7.4564 0.1520 1.6389
temp: 298.150 k
press: 1.00000 atm
elementType: 6 6 6 6 6 6 1 1 1 1 8 6 1 1 1 6 6 1 6 1 6 8 6 6 6 6 1 6 1 6 1 8 8 6 1 1 1 6 1 1 1 6 1 6 6 6 8 6 1 1 1 6 1 1 6 1 1 6 8 6 6 6 6 1 6 1 6 1 1 8 6 1 1 6 6 6 6 1 6 1 6 1 1 8 6 1 1 1 1
symmnumber: 1
zpe: 1907450.4 jmol-1
zpe.correction: 0.726509 hartree
zpe.thermalcorrener: 0.771080 hartree
zpe.thermalcorrenthalpy: 0.772024 hartree
zpe.thermalcorrgfe: 0.641179 hartree
zpe.sumelectzpe: -2187.577815 hartree
zpe.sumelectthermal: -2187.533244 hartree
zpe.sumelectthermalent: -2187.532300 hartree
zpe.sumelectthermalfe: -2187.663145 hartree
dipole: -0.4717 -0.2897 -0.3049
dipole: 0.6320
quadrupole: -268.7863 -284.6460 -260.1634
quadrupole: -7.5996 7.6337 -20.9914
quadrupole: 2.4123 -13.4474 11.0352 -7.5996 7.6337 -20.9914
hfenergy: -2188.3043242 hartree
pointgroup: C01 [X(C41H40O8)]
dipole: -0.1855782 -0.1139877 -0.1199591 debye
polarizability: 632.4549825|-47.8681311|498.0649377|-7.2074628|-15.3849051|436.8744111 unknown
InChI: InChI=1/41C.8O.40H
charge 0 multiplicity 1
89 atoms
C  -7.44955842 -0.02955212 -0.52465823
C  -6.20645413 0.09783575 -1.13548172
C  -5.03251372 0.23804693 -0.37900435
C  -5.13929188 0.22135892 1.01392588
C  -6.37876029 0.08336933 1.64569439
C  -7.54248277 -0.03407506 0.87484564
H  -8.35688412 -0.14107212 -1.10954691
H  -6.14802273 0.0818557 -2.22172333
H  -4.24320124 0.3091399 1.61824353
H  -6.42097444 0.07231271 2.72826336
O  -8.80340639 -0.16636185 1.38778999
C  -8.96381709 -0.17870759 2.8012359
H  -8.43283075 -1.02402963 3.2567019
H  -8.61367901 0.75836854 3.25183156
H  -10.03469235 -0.28736216 2.97754311
C  -3.71547695 0.42238602 -1.08139329
C  -3.17709035 1.89047846 -1.30700752
H  -3.77704765 -0.0368402 -2.07862737
C  -1.68256329 1.59491241 -1.34722124
H  -3.57638057 2.22158495 -2.26899696
C  -1.48173157 0.35050676 -0.72619562
O  -2.6541752 -0.26345996 -0.37333354
C  -3.59812985 2.91226722 -0.25293854
C  -4.77639344 3.64293597 -0.4593086
C  -2.84662643 3.10418589 0.91157281
C  -5.20576721 4.5575713 0.51330914
H  -5.35208616 3.4787948 -1.36241528
C  -3.28570421 4.02740578 1.87307555
H  -1.93082398 2.54506015 1.05075372
C  -4.46212724 4.75362293 1.67894367
H  -4.79300722 5.46811368 2.42383924
O  -6.34263739 5.3121868 0.40793745
O  -2.62121885 4.28694422 3.04049954
C  -7.17410734 5.13809999 -0.73234016
H  -8.01776673 5.81473888 -0.58946717
H  -6.64810175 5.40686017 -1.65745181
H  -7.54196801 4.10741637 -0.80662015
C  -1.40372712 3.5975584 3.30126213
H  -1.05841417 3.96477659 4.26864507
H  -1.56003362 2.51331597 3.35839575
H  -0.6478649 3.81625708 2.53720099
C  -0.23961217 -0.18597777 -0.44374117
H  -0.11763028 -1.1449066 0.04459648
C  -0.54602001 2.32882167 -1.70845959
C  0.87626758 0.57985526 -0.81584031
C  0.75191856 1.81906451 -1.46234413
O  -0.54577065 3.57148131 -2.28532287
C  -1.67635532 4.0304944 -3.02198375
H  -2.50851492 4.29637541 -2.36358957
H  -1.33801817 4.92513508 -3.54825299
H  -1.99795224 3.28044816 -3.75420594
C  1.97849419 2.579411 -1.91848565
H  1.80982833 2.98398342 -2.9218451
H  2.14602936 3.4534921 -1.27306365
C  3.2172863 1.6775523 -1.90632749
H  3.20102756 0.98192287 -2.75463769
H  4.1335583 2.27122362 -1.9905628
C  3.26093821 0.8560287 -0.61381167
O  2.09230118 0.01301983 -0.53449108
C  4.47928381 -0.03005179 -0.49557645
C  5.58384354 0.38529296 0.26191878
C  4.56127749 -1.25435711 -1.16544145
C  6.73949924 -0.38701064 0.33502705
H  5.54218489 1.32673071 0.80507673
C  5.70933748 -2.04922201 -1.09340919
H  3.70687121 -1.60992321 -1.73274447
C  6.80989252 -1.60979247 -0.34684852
H  7.59589314 -0.06408096 0.91825191
H  5.72302779 -3.00732877 -1.59786201
O  7.99219765 -2.29205101 -0.21381919
C  8.20731169 -3.4920249 -0.96150234
H  7.92384617 -3.34128124 -2.01156724
H  9.29441078 -3.62114618 -0.92976394
C  7.5135139 -4.71391047 -0.39214885
C  7.34211171 -4.87614795 0.98434366
C  7.07475965 -5.74104722 -1.24180088
C  6.74606145 -6.02628905 1.51260516
H  7.66598736 -4.08872966 1.65830787
C  6.48944509 -6.896352 -0.73393271
H  7.1889136 -5.63727109 -2.31885529
C  6.31940235 -7.04469202 0.65056657
H  6.62133658 -6.11226215 2.5854581
H  6.14696333 -7.68991845 -1.39011343
O  5.72746137 -8.20840151 1.05638349
C  5.51363613 -8.41325329 2.44752511
H  5.03318591 -9.38857468 2.53369365
H  6.46122336 -8.42458173 3.00078695
H  4.8538197 -7.64415147 2.86829296
H  3.23490581 1.54472625 0.24484842
