program: Gaussian 16
title: NMR project
version: ES64L-G16RevC.01
method: RB3LYP
basis: 6-31+G(d,p)
operation: Freq
keyword: #N
keyword: Geom=AllCheck
keyword: Guess=TCheck
keyword: SCRF=Check
keyword: GenChk
keyword: RB3LYP/6-31+G(d,p)
keyword: Freq
converged: YES YES YES YES
title: Mulliken charges:
elementType: C C C C C C H H H H O C H H H C C H C H C O C C C C H C H C H O O C H H H C H H H C H C C C O C H H H C H H C H H C O C C C C H C H C H H O C H H C C C C H C H C H H O C H H H H
charge: 0.241621 -0.418729 0.455945 0.033392 -0.051181 -0.039799 0.116667 0.127102 0.108151 0.130158 -0.336656 -0.144990 0.144609 0.147660 0.148721 -0.307743 -0.149378 0.124982 0.396775 0.126243 -0.431165 -0.206231 0.597575 -0.141127 -0.159294 -0.133011 0.096287 -0.278175 0.123739 -0.239723 0.139067 -0.309015 -0.340112 -0.136799 0.146064 0.139395 0.152854 -0.114307 0.148575 0.145084 0.145959 -0.438382 0.134164 0.168454 -0.173077 0.238948 -0.283203 -0.049235 0.140348 0.160302 0.140936 -0.377597 0.162966 0.159867 -0.572595 0.137349 0.150983 0.115253 -0.293957 0.632323 -0.127457 -0.357526 -0.149004 0.114893 -0.178906 0.132076 -0.325912 0.129977 0.121378 -0.274186 -0.124917 0.158476 0.130894 0.264024 -0.514142 0.014408 0.403796 0.109860 -0.085945 0.134302 -0.264296 0.118278 0.133339 -0.354128 -0.138569 0.150164 0.144159 0.143556 0.138373
chargesum: -0.00000
title: Mulliken charges with hydrogens summed into heavy atoms:
elementType: C C C C C C O C C C C C O C C C C C C O O C C C C C C O C C C C O C C C C C C O C C C C C C C O C
charge: 0.358288 -0.291627 0.455945 0.141542 0.078977 -0.039799 -0.336656 0.296000 -0.182761 -0.023135 0.396775 -0.431165 -0.206231 0.597575 -0.044840 -0.035555 -0.133011 -0.278175 -0.100656 -0.309015 -0.340112 0.301513 0.325310 -0.304218 0.168454 -0.173077 0.238948 -0.283203 0.392352 -0.054764 -0.284264 0.253626 -0.293957 0.632323 -0.012565 -0.225450 -0.019027 -0.057528 -0.325912 -0.274186 0.164452 0.264024 -0.404281 0.148709 0.522074 0.047394 -0.264296 -0.354128 0.299310
chargesum: 0.00000
1716.lowfreq: -0.6370 -0.0004 0.0007 0.0009 1.3710 3.1553 5.6252 7.2577 15.4478
frequency: 5.4914 7.2314 15.4416 17.9897 18.5432 24.5105 26.5921 29.5717 32.3117 41.3198 49.2862 54.9413 68.8335 69.0834 78.6636 87.2685 101.5245 102.4569 108.7139 121.0705 132.2871 143.7663 149.2963 160.9294 172.2291 187.1731 188.6333 190.8201 201.5233 204.1380 224.4265 230.2548 232.2961 239.5319 246.8556 249.3797 253.2816 261.7327 273.5697 283.2060 287.3574 298.2340 302.5128 309.5163 324.3930 329.0815 345.0668 357.9658 364.0390 366.6758 375.6746 408.7408 422.6967 423.4997 424.5801 431.3576 436.5770 462.9063 478.7893 490.5891 497.8991 515.3647 520.5789 526.5184 531.6775 542.6425 547.7797 554.1330 567.8663 589.0162 589.4138 604.6827 624.5895 625.7682 627.4387 630.9866 643.3997 646.5080 651.0680 659.0212 679.6332 695.3470 699.7536 710.2653 718.6314 727.6076 739.8366 753.3029 767.9414 789.8603 793.0505 812.4187 817.8877 821.7879 822.3354 826.4561 829.9730 832.0786 840.1453 843.3925 848.8100 851.4290 854.5252 861.7626 864.9974 874.6326 913.3984 929.8309 938.5022 939.4892 949.8627 953.1053 957.1479 968.3186 968.5185 975.5053 977.7304 1001.4605 1006.7190 1011.5926 1020.9075 1024.5029 1027.3011 1030.2634 1032.7739 1043.8915 1051.7400 1066.3990 1066.8795 1076.4835 1086.5670 1089.1631 1127.8107 1136.9103 1137.6381 1142.7809 1156.0901 1170.8741 1171.8952 1171.9629 1172.4469 1172.8630 1179.2052 1181.5202 1187.0588 1188.4273 1197.7092 1198.4110 1202.3605 1205.7597 1205.9602 1206.8964 1212.9672 1217.1859 1223.4970 1224.2650 1226.4869 1236.7497 1251.2853 1256.3530 1262.2808 1275.5631 1281.7110 1286.5677 1297.1185 1303.3714 1318.4585 1326.7479 1332.8361 1333.6415 1334.0668 1338.5678 1344.9417 1345.8201 1354.6175 1358.2243 1361.2054 1377.7811 1380.2465 1383.9909 1394.0038 1405.6615 1418.0576 1449.1149 1454.5521 1456.8330 1461.8380 1466.4210 1479.7622 1480.5452 1482.7448 1485.6220 1490.0456 1493.8095 1497.1777 1497.2968 1497.5690 1497.8114 1497.9697 1500.8310 1500.8842 1501.4075 1502.8120 1509.0333 1509.3346 1509.9667 1517.8062 1518.9601 1546.5951 1550.8468 1553.4158 1623.4610 1625.5056 1625.8123 1629.7934 1632.5295 1651.7306 1660.0770 1661.3362 1662.8642 1663.6440 3005.7483 3015.4810 3015.8366 3017.6302 3020.8344 3027.4609 3029.8003 3030.9912 3042.5335 3056.3937 3078.3227 3079.9388 3081.5454 3083.1010 3085.2108 3085.5282 3093.0219 3098.0663 3109.6891 3139.9739 3147.7994 3148.7832 3150.5776 3150.9083 3167.1972 3167.7589 3170.4837 3194.5878 3206.0605 3207.1921 3211.0308 3211.0757 3215.5223 3215.9421 3221.7655 3224.0419 3226.1188 3231.4111 3232.8329 3235.6136
redmass: 6.1027 5.8880 5.3728 5.3966 4.5516 4.2396 5.0463 5.0538 5.0159 3.9639 3.8577 4.2758 2.9620 3.5046 3.7577 3.8728 3.8586 4.5698 5.1745 5.0767 4.8512 4.6191 4.2204 4.2028 4.8229 3.3433 4.8071 3.9777 1.5754 2.8614 2.6362 2.9394 2.0904 1.6958 1.4708 3.2447 1.2558 1.7201 2.6459 1.8720 3.5892 5.7885 4.5850 3.9096 3.7281 4.1249 3.7543 3.1701 3.6531 4.3649 4.4458 5.0919 3.1246 3.1982 3.0297 6.0612 4.6821 4.8284 4.6653 6.0726 4.5304 3.3422 2.9160 4.1124 4.1653 3.9049 3.8281 3.7892 4.6169 4.8178 5.6835 4.5752 4.4973 4.9534 4.1287 5.1599 5.2221 6.3493 6.6306 6.4391 4.9094 2.4732 3.7626 3.5333 3.5421 4.0189 5.0350 4.3703 3.8211 2.8716 4.3445 2.8062 1.6404 1.5484 1.5637 1.5370 1.6761 1.8015 2.0788 1.7223 2.5895 2.0633 2.3868 1.7905 3.0054 2.8033 2.5715 3.3570 5.0509 1.3147 1.7613 1.3763 2.1921 1.3589 1.3427 3.0048 1.3234 5.0348 6.0280 4.8168 2.4159 2.9809 3.1374 3.7272 2.0761 2.1432 3.9714 6.0368 6.1791 5.8659 2.3889 1.9467 3.5524 1.3341 1.4038 1.4097 3.3893 1.2716 1.2713 1.2725 1.2717 1.2776 1.7933 1.6733 1.5854 1.9834 1.1792 1.1695 1.2925 1.4190 1.4050 1.4825 1.3848 1.4744 2.0554 2.7103 1.8351 1.8582 2.1054 2.3357 2.0473 1.4746 4.0203 4.0709 1.7720 1.7302 1.5076 2.0293 1.4310 1.5654 1.4747 2.6173 2.7474 3.0034 3.3324 2.9274 1.8422 2.7184 2.5446 1.5302 1.7661 1.5322 2.8342 2.8977 2.9379 2.7207 2.5749 1.4565 1.1826 1.1982 1.4959 1.2465 1.5392 1.3000 1.0706 1.2823 1.0481 1.0972 1.0466 1.0975 1.2579 1.7718 1.7236 1.0502 1.0567 1.0593 1.4367 1.1420 2.4946 2.4973 2.5754 6.6417 6.5911 6.7151 8.9044 5.9562 6.4393 8.0273 5.9649 5.8481 6.1672 1.0850 1.0344 1.0346 1.0342 1.0338 1.0708 1.0347 1.0625 1.0679 1.0814 1.1062 1.1058 1.1064 1.1019 1.0843 1.1063 1.0914 1.1014 1.1036 1.1033 1.0999 1.1005 1.1000 1.0996 1.0894 1.0889 1.0884 1.0879 1.0931 1.0928 1.0946 1.0880 1.0894 1.0881 1.0913 1.0917 1.0935 1.0925 1.0928 1.0894
irintensity: 0.0315 0.0661 0.1872 0.0777 0.0957 0.3768 0.0713 0.2387 0.3459 1.2973 0.0462 1.6940 6.8411 2.1818 3.7407 1.5345 0.0735 0.6276 4.3292 3.1022 0.6408 0.3727 2.2843 1.0461 1.5454 0.2639 1.9273 0.7750 0.0784 1.3857 3.0715 3.7735 0.2755 0.3613 0.9958 2.5873 0.7577 0.7724 0.1919 0.1213 0.3030 1.3406 0.5738 2.7520 0.7130 3.1793 8.7519 0.7595 0.3355 1.7523 2.7755 1.4075 0.8276 0.4609 0.6596 0.1640 1.1576 2.7357 5.2546 0.0023 2.2033 5.6536 17.6485 7.9325 19.1368 15.7331 6.3640 5.4480 13.0242 14.1782 17.7645 14.0411 2.2738 2.7750 5.9830 5.9406 5.0882 0.1552 2.4863 3.4313 0.3934 6.3508 2.3421 6.1902 0.1745 1.6057 6.2615 7.2544 26.0414 10.7598 12.5887 2.2324 39.3098 5.5138 22.2618 8.2269 23.1604 30.0572 25.0287 0.6678 25.2827 22.9290 17.0707 41.2800 6.2921 16.9556 0.2399 0.6272 9.5578 1.7749 9.0328 4.0226 6.6668 1.3520 0.5312 52.8305 0.2745 5.5032 3.1417 65.8157 5.2810 3.7569 10.7940 16.1411 14.0171 19.6912 83.0207 49.9161 41.3503 2.7817 12.1453 20.7888 123.8770 26.8049 24.3726 25.7147 458.6512 0.7327 0.2609 1.0801 0.9509 17.6534 76.1475 51.3729 21.8267 241.1410 60.5137 24.3689 51.2779 16.4945 20.8482 9.6855 0.7132 3.3964 233.3850 8.7739 9.6625 17.8113 230.8254 49.7948 73.5348 27.6068 276.5612 291.8797 73.7755 41.3056 16.1540 24.7551 17.1771 9.6247 3.4547 43.6029 7.0650 73.5344 12.6533 77.7032 53.0028 39.0343 21.9523 5.0596 28.6430 24.6227 40.4813 23.8931 43.2624 3.3943 65.8989 51.9468 6.2710 15.9193 18.3995 1.9287 75.9729 27.9005 6.3720 56.0667 10.7204 14.3192 6.9230 6.5951 4.3850 28.6320 42.7642 44.3661 37.2664 43.3775 2.0021 21.6600 169.1763 92.2648 120.7827 36.4396 5.8063 36.3291 114.3243 143.2186 180.8618 356.8751 110.3301 85.4188 22.7231 34.5754 52.4889 54.3828 60.2378 41.2629 19.3755 46.7914 46.7969 16.7183 57.0082 42.0862 36.8367 31.7059 19.1909 23.8484 30.3921 19.9682 42.0051 21.7090 22.0082 26.5216 26.5934 26.0501 21.8136 12.6227 13.1692 15.8774 3.3435 10.0928 9.1482 5.2602 5.0374 5.2346 2.6223 8.2904 0.7031 5.5211 0.2131 6.3651 1.8227
temp: 298.150 k
press: 1.00000 atm
elementType: 6 6 6 6 6 6 1 1 1 1 8 6 1 1 1 6 6 1 6 1 6 8 6 6 6 6 1 6 1 6 1 8 8 6 1 1 1 6 1 1 1 6 1 6 6 6 8 6 1 1 1 6 1 1 6 1 1 6 8 6 6 6 6 1 6 1 6 1 1 8 6 1 1 6 6 6 6 1 6 1 6 1 1 8 6 1 1 1 1
symmnumber: 1
zpe: 1908457.2 jmol-1
zpe.correction: 0.726893 hartree
zpe.thermalcorrener: 0.771290 hartree
zpe.thermalcorrenthalpy: 0.772235 hartree
zpe.thermalcorrgfe: 0.641877 hartree
zpe.sumelectzpe: -2187.574189 hartree
zpe.sumelectthermal: -2187.529792 hartree
zpe.sumelectthermalent: -2187.528848 hartree
zpe.sumelectthermalfe: -2187.659205 hartree
dipole: -1.4470 -2.5962 -1.0494
dipole: 3.1521
quadrupole: -280.8077 -266.4022 -284.0038
quadrupole: 9.5676 -0.4812 10.6578
quadrupole: -3.7364 10.6690 -6.9326 9.5676 -0.4812 10.6578
hfenergy: -2188.3010824 hartree
pointgroup: C01 [X(C41H40O8)]
dipole: -0.5692988 -1.0214336 -0.4128592 debye
polarizability: 624.7918983|24.5512244|484.7999201|-2.1687504|29.2178964|425.1471745 unknown
InChI: InChI=1/41C.8O.40H
charge 0 multiplicity 1
89 atoms
C  -5.77451021 0.56770804 2.94303973
C  -4.45253012 0.60555239 2.48989933
C  -3.94899962 -0.37994124 1.63710643
C  -4.80403665 -1.42512497 1.25436297
C  -6.12533479 -1.47364259 1.68625022
C  -6.62009191 -0.47127854 2.53346024
H  -6.12794604 1.34887701 3.60538439
H  -3.8040238 1.41207541 2.81366105
H  -4.42944003 -2.21880383 0.61141161
H  -6.785747 -2.28317781 1.39248583
O  -7.92873651 -0.60106914 2.90902439
C  -8.49035898 0.3853927 3.76655295
H  -7.97052056 0.41878791 4.73226322
H  -8.46490526 1.37954409 3.30317521
H  -9.52717406 0.08586813 3.92453241
C  -2.54206786 -0.3403515 1.10698827
C  -2.24188322 0.52501858 -0.18036189
H  -2.22355234 -1.36516712 0.86694942
C  -0.77397945 0.84198847 0.07933636
H  -2.39458215 -0.13431974 -1.03853528
C  -0.53718704 0.65156995 1.45113808
O  -1.62681266 0.15326033 2.11536268
C  -3.13628724 1.74846131 -0.36972691
C  -4.31646636 1.6086957 -1.11299157
C  -2.80941317 2.98130271 0.20541687
C  -5.17504615 2.70701349 -1.26594793
H  -4.56028468 0.64624808 -1.54683275
C  -3.67547422 4.07302083 0.03867667
H  -1.88732984 3.07921529 0.76294883
C  -4.8569152 3.94024955 -0.69320021
H  -5.51892898 4.78883048 -0.8216393
O  -6.35035842 2.67038541 -1.96628374
O  -3.44360249 5.31687557 0.55891362
C  -6.76019101 1.43938616 -2.54797239
H  -7.71858838 1.64324743 -3.02749956
H  -6.04363789 1.09482405 -3.30467433
H  -6.89181654 0.66044891 -1.78697535
C  -2.250271 5.53428011 1.30349151
H  -1.35788429 5.35635444 0.69122219
H  -2.27893577 6.58160959 1.60710054
H  -2.21192298 4.89763509 2.19595171
C  0.65064542 0.96188899 2.0858642
H  0.80621306 0.79042812 3.14392963
C  0.26269353 1.39019337 -0.68636706
C  1.66897005 1.50442651 1.28524108
C  1.49957874 1.73224881 -0.08781959
O  0.20186699 1.68122325 -2.02328537
C  -0.73105152 1.01686936 -2.87074693
H  -0.67936646 -0.06966431 -2.73353013
H  -1.75311114 1.37056229 -2.70622621
H  -0.42701077 1.26489443 -3.88945053
C  2.61936555 2.3375341 -0.9036832
H  3.13877841 1.55790868 -1.47760796
H  2.21053961 3.03619876 -1.6392239
C  3.60914669 3.05667026 0.01614778
H  4.50577847 3.35734472 -0.53463131
H  3.15211743 3.96916308 0.41874302
C  4.00541854 2.1620112 1.19830137
O  2.83675711 1.78359538 1.949928
C  4.83464368 0.94516611 0.80109161
C  6.10675232 1.13299257 0.23288492
C  4.39659277 -0.36482296 1.0009973
C  6.90392507 0.05353077 -0.12963079
H  6.49055901 2.13902663 0.07958254
C  5.18474996 -1.46457146 0.63699353
H  3.42627775 -0.54418531 1.44975915
C  6.44551231 -1.25756002 0.07026792
H  7.88937171 0.2024055 -0.55943838
H  4.79529678 -2.46383024 0.78580905
O  7.31291532 -2.24931369 -0.31149095
C  6.99759737 -3.61598856 -0.02883466
H  7.96331664 -4.12383574 -0.12227255
H  6.66684357 -3.72260109 1.01259873
C  5.98633587 -4.23030077 -0.97577196
C  5.05637878 -5.16435465 -0.51722951
C  5.99772363 -3.92125089 -2.34604331
C  4.15563892 -5.79145645 -1.38770162
H  5.02091705 -5.41681445 0.540549
C  5.10563007 -4.52587552 -3.22296719
H  6.70749401 -3.19014085 -2.7214729
C  4.17922665 -5.46893735 -2.74912092
H  3.44761586 -6.50974672 -0.99194508
H  5.10720832 -4.28520732 -4.28122389
O  3.34625762 -6.0088708 -3.6897586
C  2.39093297 -6.97688738 -3.27513672
H  1.85198362 -7.26853493 -4.17739516
H  2.87776952 -7.85941865 -2.84109586
H  1.68371621 -6.55615988 -2.54906801
H  4.5849518 2.75381634 1.91617589
