program: Gaussian 16
title: NMR project
version: ES64L-G16RevC.01
method: RB3LYP
basis: 6-31+G(d,p)
operation: Freq
keyword: #N
keyword: Geom=AllCheck
keyword: Guess=TCheck
keyword: SCRF=Check
keyword: GenChk
keyword: RB3LYP/6-31+G(d,p)
keyword: Freq
converged: YES YES NO YES
title: Mulliken charges:
elementType: C C C C C C H H H H O C H H H C C H C H C O C C C C H C H C H O O C H H H C H H H C H C C C O C H H H C H H C H H C O C C C C H C H C H H O C H H C C C C H C H C H H O C H H H H
charge: 0.052426 -0.371810 0.306310 0.189908 -0.084294 -0.034463 0.115262 0.105912 0.132769 0.129159 -0.329482 -0.144978 0.143349 0.147763 0.144983 -0.419822 0.245417 0.127201 0.541773 0.142948 -0.761737 -0.201709 0.410205 -0.275121 0.172943 0.136188 0.116042 -0.774703 0.106393 0.232273 0.124809 -0.343555 -0.285932 -0.130411 0.144274 0.144635 0.145206 -0.097469 0.155419 0.149459 0.143221 -0.255164 0.134766 0.078954 -0.593097 0.278837 -0.236654 -0.047028 0.143840 0.140517 0.137806 -0.347918 0.161016 0.163034 -0.666925 0.139059 0.153378 0.099752 -0.277099 0.696724 -0.121074 -0.333508 -0.041876 0.115725 -0.283840 0.130191 -0.339135 0.129981 0.122344 -0.278788 -0.151907 0.158760 0.131801 0.265241 -0.365632 -0.209803 0.408480 0.131445 -0.030648 0.112718 -0.256664 0.118333 0.133597 -0.350225 -0.127903 0.144658 0.144639 0.150258 0.138269
chargesum: -0.00000
title: Mulliken charges with hydrogens summed into heavy atoms:
elementType: C C C C C C O C C C C C O C C C C C C O O C C C C C C O C C C C O C C C C C C O C C C C C C C O C
charge: 0.167689 -0.265897 0.306310 0.322677 0.044865 -0.034463 -0.329482 0.291117 -0.292621 0.388365 0.541773 -0.761737 -0.201709 0.410205 -0.159078 0.279336 0.136188 -0.774703 0.357083 -0.343555 -0.285932 0.303705 0.350631 -0.120397 0.078954 -0.593097 0.278837 -0.236654 0.375134 -0.023868 -0.374488 0.238021 -0.277099 0.696724 -0.005349 -0.203317 0.088105 -0.161496 -0.339135 -0.278788 0.138654 0.265241 -0.234187 -0.097084 0.526813 0.102948 -0.256664 -0.350225 0.311651
chargesum: 0.00000
1716.lowfreq: -3.2629 -0.6270 0.0001 0.0008 0.0009 1.4253 4.2898 6.5680 12.8134
frequency: 4.2036 6.5551 12.7984 16.0038 19.1468 21.4917 25.5035 26.8639 32.0410 41.4764 49.0140 52.1582 60.4960 72.8028 81.7685 85.7874 93.3561 94.2253 110.4256 119.2015 131.8534 144.3925 150.5648 154.9718 161.2397 164.5080 179.8372 192.5066 194.2286 208.5022 212.9744 222.4280 227.6752 235.6270 246.1576 248.7948 255.3426 275.3000 277.7127 279.5401 283.0517 289.7606 296.1920 304.5701 321.8696 326.0065 344.0124 347.5160 351.5998 360.9832 399.6918 422.4457 423.2044 423.6604 431.2902 434.4008 442.2942 451.9663 465.0381 481.1979 498.3296 514.4013 519.4784 524.9333 530.5551 543.6556 546.2424 551.5500 553.5588 591.0881 595.0522 604.3476 623.7413 628.4196 633.2150 644.8309 647.7370 650.4137 653.9423 661.0271 690.2360 697.0423 705.8930 711.8845 718.3431 722.2745 735.5563 742.9536 758.2766 770.9712 789.5034 809.3648 817.3851 819.0826 824.2168 825.7905 828.9878 836.3812 838.8581 839.3629 845.5298 847.8977 849.6168 854.6820 861.6309 888.6253 912.8276 927.4600 946.5090 948.9114 949.4518 952.4694 957.9937 968.2950 970.9132 974.0522 984.8150 991.7778 1004.5380 1010.5278 1021.1323 1023.1727 1024.8056 1031.8317 1035.6719 1044.5985 1051.1520 1067.4175 1068.0775 1080.8405 1088.6627 1095.2954 1106.9072 1137.0901 1139.0430 1140.7515 1147.4436 1170.3873 1171.8634 1171.8859 1171.9859 1172.5728 1173.4261 1179.5240 1185.7876 1191.6541 1195.8448 1200.9844 1201.7211 1205.1946 1205.8194 1205.8966 1210.7230 1211.5214 1222.3360 1222.6778 1233.2207 1238.0477 1251.1769 1254.3505 1261.1735 1281.0533 1285.6061 1286.4983 1292.5171 1297.7699 1319.4259 1321.6523 1332.5771 1333.4984 1333.9010 1340.6771 1342.5965 1345.2216 1348.1589 1354.3098 1355.8174 1374.4564 1382.6183 1385.5967 1394.1609 1405.2592 1411.6691 1449.8431 1455.6720 1456.2327 1459.9431 1469.4435 1480.0228 1480.1547 1481.6799 1483.4736 1489.2306 1490.9402 1496.1705 1497.1997 1497.6384 1497.6758 1498.7006 1499.3028 1500.1663 1502.5602 1504.2289 1506.0340 1509.2658 1509.8666 1512.9153 1516.4928 1546.6739 1551.3324 1551.6425 1623.5648 1625.6848 1625.7297 1632.3070 1642.4382 1649.7960 1657.6773 1661.3087 1661.9500 1662.4274 3006.0053 3015.1195 3016.1841 3016.2676 3022.8614 3023.4810 3025.5178 3031.2479 3043.0345 3057.4803 3077.8344 3079.0337 3079.3026 3082.7136 3086.5749 3089.4598 3095.3094 3097.2085 3098.2476 3140.8059 3148.2548 3148.3965 3149.1650 3151.2654 3168.7665 3169.1037 3177.9795 3193.3345 3195.1610 3198.8577 3205.8032 3209.0697 3215.0856 3215.1534 3221.5177 3221.8025 3228.4319 3231.7237 3235.5968 3241.3764
redmass: 5.6695 6.2732 5.3498 4.9970 4.9083 5.4590 4.4197 4.3343 5.3683 3.7646 3.8867 4.0261 2.1862 3.6943 3.7221 3.4464 3.4046 3.8235 4.5946 4.8382 3.4498 2.5582 4.7206 2.2129 4.4717 4.3377 4.1060 3.1413 3.1514 1.8374 3.0030 1.9435 4.4931 1.4113 2.0682 1.8557 3.4945 1.8680 2.7402 2.4394 3.4262 4.5688 4.3197 3.6663 4.6122 4.4362 4.8202 3.7694 3.0571 3.9754 4.4271 3.1437 3.0996 3.0610 4.8832 4.8647 5.0238 5.2458 5.2885 5.1897 4.1222 3.2998 3.6297 4.4576 3.7121 3.2658 5.2994 3.6098 3.8211 6.6414 4.6931 5.0617 4.3498 4.8107 4.3980 6.8001 5.7513 4.5906 6.2746 4.9841 3.7529 3.0666 3.2153 3.2988 3.6319 4.2674 5.0126 5.2500 4.3550 4.9703 2.8829 2.8243 3.5382 1.6348 1.3445 1.3617 2.0500 1.8600 1.5289 1.5613 1.7703 3.0019 2.0764 2.1262 1.7514 3.6232 2.5309 3.3681 1.4664 1.3745 3.3454 1.5527 3.0602 1.3425 1.3371 1.3537 6.0092 3.8092 5.0656 4.3717 3.6249 2.5393 2.9210 2.0664 2.8161 2.4275 3.9241 5.9303 5.9723 3.1816 3.2196 2.2655 4.1168 1.4580 1.7699 1.3271 1.9719 1.6562 1.2793 1.2830 1.2822 1.2723 1.2711 1.6997 1.6479 1.5680 1.1874 1.3894 1.2271 1.4237 1.4324 1.3559 1.4326 1.4307 2.4087 2.5684 2.0015 2.3149 2.0995 1.3511 1.8663 1.6312 3.3882 4.2703 2.0703 1.7006 1.5217 1.6588 1.9638 1.9672 1.4476 1.8444 2.4994 2.8403 2.9188 2.7165 1.9563 2.4713 1.4562 2.8839 2.4343 1.5367 2.4750 2.8622 2.7926 2.6705 2.7192 1.3426 1.1829 1.1876 1.4349 1.3235 1.2256 1.4396 1.0466 1.0529 1.0491 1.0474 1.6647 1.3396 1.5868 1.0958 1.8210 1.0686 1.0579 1.0599 1.1990 1.3799 2.4985 2.4908 2.4854 6.6136 6.5581 6.6048 9.1948 6.0738 6.5954 8.9593 5.8595 5.9031 5.7866 1.0835 1.0343 1.0344 1.0341 1.0333 1.0481 1.0578 1.0626 1.0671 1.0819 1.1062 1.1062 1.1063 1.1018 1.0874 1.1066 1.0916 1.1022 1.1014 1.1024 1.1000 1.1009 1.0997 1.0997 1.0890 1.0884 1.0893 1.0907 1.0889 1.0881 1.0930 1.0930 1.0881 1.0941 1.0921 1.0915 1.0923 1.0929 1.0904 1.0900
irintensity: 0.0420 0.0182 0.3342 0.2574 0.0276 0.0147 0.1989 1.0314 0.2573 1.6875 0.1344 1.0060 5.3836 4.1957 3.0703 3.2917 0.1916 0.1194 1.8780 4.8527 0.6198 1.5332 1.0378 1.2887 0.7877 0.8300 2.4353 1.7187 1.3262 0.4561 0.1245 0.3604 5.4143 0.5949 0.8679 0.5204 0.3407 1.0430 0.6385 0.1948 0.7776 4.9587 2.8802 1.3050 2.8551 1.3147 0.4350 3.2941 8.5547 1.9731 2.5383 0.9472 0.6027 0.6769 1.5921 5.1228 0.4861 2.7048 1.7390 3.0734 4.0339 8.1041 18.2892 8.3899 3.6386 4.7965 6.2360 13.2773 17.9722 2.8682 13.8222 12.8037 0.8637 10.7432 0.2873 2.6252 1.7055 3.4289 0.7781 2.3177 4.3285 3.4541 3.6931 11.3404 1.7704 1.4733 8.4550 14.3452 10.6131 17.0618 15.4182 13.3338 16.0977 21.9418 8.8683 15.8143 32.9987 57.0877 16.9932 21.2020 7.9127 13.8388 27.0086 14.5131 11.2385 17.6801 2.2146 16.5800 0.8025 0.1748 10.2068 2.9368 9.7411 0.1688 0.3302 0.3757 28.9447 9.0801 18.6211 8.3629 37.2303 2.0577 4.2485 5.6087 21.5665 45.7339 81.8689 50.0666 51.9086 33.9928 38.4103 57.2196 175.9358 63.2004 128.2642 9.0215 181.5145 118.6488 6.1212 4.8172 1.0990 0.9081 2.0435 8.4477 270.3031 52.0630 60.1738 15.8531 52.0982 20.0701 6.2921 25.1713 0.9315 9.4210 17.3263 1.7938 165.7802 59.2003 258.8419 8.1641 80.9599 17.5558 234.7783 217.3789 20.3016 118.6468 23.7816 10.4267 39.5002 66.3197 2.3030 6.6517 48.8767 50.3208 4.6598 91.6698 15.1771 33.1571 6.4974 96.7602 33.2710 4.9294 25.3193 11.4211 18.1095 7.0073 54.6995 43.6975 7.7662 6.8587 13.5439 14.7826 24.8902 54.9428 8.9227 9.6693 5.4855 6.6653 82.4290 3.6651 56.1266 6.4915 72.3758 5.1736 33.2871 31.7599 20.5762 17.5467 170.5096 96.8041 121.4152 28.5727 18.1479 7.3937 102.2271 177.2144 206.8300 301.9568 91.7892 31.1033 74.5117 15.7084 58.8249 42.1169 88.1212 36.5591 21.1839 59.3732 46.8266 17.1421 55.3051 39.7733 36.7863 38.2644 19.5371 24.8204 26.3771 19.2872 33.4383 40.7206 18.9994 27.5668 20.4139 27.1197 21.0513 12.5141 15.6300 9.4968 3.8111 4.1961 4.5031 9.9484 5.1108 2.9392 4.4856 7.8118 9.7693 0.3369 6.2418 2.4286 1.6583
temp: 298.150 k
press: 1.00000 atm
elementType: 6 6 6 6 6 6 1 1 1 1 8 6 1 1 1 6 6 1 6 1 6 8 6 6 6 6 1 6 1 6 1 8 8 6 1 1 1 6 1 1 1 6 1 6 6 6 8 6 1 1 1 6 1 1 6 1 1 6 8 6 6 6 6 1 6 1 6 1 1 8 6 1 1 6 6 6 6 1 6 1 6 1 1 8 6 1 1 1 1
symmnumber: 1
zpe: 1906986.6 jmol-1
zpe.correction: 0.726333 hartree
zpe.thermalcorrener: 0.770957 hartree
zpe.thermalcorrenthalpy: 0.771901 hartree
zpe.thermalcorrgfe: 0.640043 hartree
zpe.sumelectzpe: -2187.572136 hartree
zpe.sumelectthermal: -2187.527512 hartree
zpe.sumelectthermalent: -2187.526568 hartree
zpe.sumelectthermalfe: -2187.658426 hartree
dipole: -1.7609 0.5298 -3.8818
dipole: 4.2953
quadrupole: -255.0023 -278.2283 -277.1760
quadrupole: -1.0972 -4.9806 6.7458
quadrupole: 15.1332 -8.0927 -7.0405 -1.0972 -4.9806 6.7458
hfenergy: -2188.2984687 hartree
pointgroup: C01 [X(C41H40O8)]
dipole: -0.6928021 0.2084263 -1.5272057 debye
polarizability: 602.5412383|-0.7205414|457.3405006|9.79793|42.9917119|468.57941 unknown
InChI: InChI=1/41C.8O.40H
charge 0 multiplicity 1
89 atoms
C  -6.17581532 0.36883053 3.05356313
C  -5.19693205 -0.40300975 2.41825709
C  -3.83525361 -0.13582974 2.57557893
C  -3.46268612 0.92430028 3.41751618
C  -4.42123367 1.69857048 4.06185039
C  -5.78602093 1.43044575 3.87815636
H  -7.22135053 0.12836782 2.90231365
H  -5.51461593 -1.22610334 1.78309308
H  -2.41185764 1.13578293 3.58420724
H  -4.13440603 2.51279602 4.71986853
O  -6.65107155 2.24995828 4.55113179
C  -8.04756351 2.02634615 4.40681645
H  -8.33355967 1.03114471 4.77038316
H  -8.53552729 2.78750398 5.01704583
H  -8.36528091 2.13845734 3.36240568
C  -2.81119224 -0.9826775 1.84780607
C  -2.35665417 -0.49052449 0.40515547
H  -3.19209647 -2.00456607 1.77207267
C  -0.99954713 0.1116408 0.72203765
H  -2.20490533 -1.40169022 -0.19039333
C  -0.6295243 -0.29920724 2.00683104
O  -1.58561763 -1.0579547 2.62513683
C  -3.37539661 0.3557316 -0.33807337
C  -4.25169045 -0.27280969 -1.21994846
C  -3.46488837 1.74179947 -0.12789593
C  -5.23245584 0.47523117 -1.89391644
H  -4.19600623 -1.34130332 -1.40566645
C  -4.43970961 2.47481728 -0.80426474
H  -2.76904758 2.22070803 0.54735051
C  -5.33319172 1.8494181 -1.69233174
H  -6.06801495 2.46419901 -2.1959534
O  -6.04303431 -0.23873004 -2.73549531
O  -4.61183584 3.82584857 -0.67811668
C  -7.04959926 0.45806608 -3.45841061
H  -7.767964 0.93858626 -2.78223724
H  -6.61363927 1.21474532 -4.12283021
H  -7.56326533 -0.29631226 -4.05597036
C  -3.75342142 4.53920782 0.2064611
H  -3.85650006 4.17976146 1.23724146
H  -2.7052555 4.46054413 -0.10657397
H  -4.07232768 5.58093557 0.15065802
C  0.58040129 0.02284798 2.5977664
H  0.84331375 -0.30476043 3.5964544
C  -0.08404284 0.86854741 -0.01206886
C  1.46809063 0.80548277 1.84285969
C  1.15647718 1.24750186 0.54575109
O  -0.35723823 1.33531018 -1.28143962
C  -0.47701313 0.34769847 -2.30885803
H  -1.36811465 -0.27410588 -2.17420016
H  -0.56944843 0.89793304 -3.24729845
H  0.41644287 -0.2884008 -2.34228037
C  2.13069148 2.11927428 -0.21394367
H  2.70320136 1.52054745 -0.9356962
H  1.58403969 2.86485875 -0.79816835
C  3.09060457 2.80046572 0.76472707
H  3.89570477 3.31410119 0.23003289
H  2.553882 3.55501406 1.35304144
C  3.69348959 1.77574758 1.73663232
O  2.65126741 1.10582616 2.47051628
C  4.63773841 0.78100925 1.07044055
C  5.84735651 1.24212656 0.52246761
C  4.36431864 -0.58537069 0.99138998
C  6.74250622 0.37241386 -0.08955903
H  6.10361209 2.29752018 0.58338732
C  5.25237589 -1.47548798 0.37321055
H  3.44755389 -0.97595424 1.41824304
C  6.44864683 -0.99743994 -0.16920688
H  7.68043473 0.73020454 -0.50225541
H  4.98884115 -2.52394672 0.31156369
O  7.40222436 -1.76978534 -0.78235754
C  7.25094504 -3.19185411 -0.81014758
H  8.26063319 -3.55166913 -1.03455726
H  6.98164794 -3.56537692 0.18649455
C  6.26881925 -3.69220289 -1.85094762
C  6.14555869 -3.06237015 -3.09161507
C  5.49857692 -4.84008189 -1.60980875
C  5.27793443 -3.55230309 -4.07353688
H  6.72607552 -2.16732001 -3.2947869
C  4.63767323 -5.34761316 -2.57777306
H  5.56938838 -5.34631902 -0.64939168
C  4.52137773 -4.70350467 -3.81827595
H  5.20396366 -3.03258833 -5.02144051
H  4.03990919 -6.23391154 -2.39132176
O  3.64629098 -5.26962181 -4.70365031
C  3.48498162 -4.66532924 -5.98080834
H  3.10523044 -3.63949632 -5.89348724
H  4.42751936 -4.65908857 -6.54267689
H  2.75330319 -5.2778167 -6.50906629
H  4.24948927 2.30816172 2.5167657
