program: Gaussian 09
title: 000052814
version: EM64L-G09RevD.01
frameworkgroup: C1[X(C14H30N2)]
method: RPBEPBE
basis: SDD
operation: Freq
keyword: #pfreq=noraman
keyword: PBEPBE/SDD
title: #p freq=noraman PBEPBE/SDD
converged: YES YES NO NO
title: Mulliken charges:
elementType: N N C C C C C C C C C C C C C C H H H H H H H H H H H H H H H H H H H H H H H H H H H H H H
charge: -0.137444 -0.130797 -0.012291 -0.381548 -0.447897 -0.341273 -0.364825 -0.385574 -0.344012 -0.367899 -0.344430 -0.345384 -0.343859 -0.708288 -0.693571 -0.693812 0.189160 0.177966 0.226769 0.229463 0.208774 0.176635 0.190208 0.206632 0.168725 0.202635 0.173279 0.216020 0.213586 0.199763 0.205356 0.190666 0.206349 0.193145 0.190264 0.191355 0.190090 0.204228 0.212202 0.206672 0.212004 0.208797 0.215628 0.212299 0.209360 0.214873
chargesum: 0.00000
title: Mulliken charges with hydrogens summed into heavy atoms:
elementType: N N C C C C C C C C C C C C C C
charge: -0.137444 -0.130797 0.176868 0.023187 -0.009660 0.025570 0.010532 -0.009659 0.085594 0.037220 0.052586 0.038025 0.037586 -0.085186 -0.057142 -0.057280
polarizability: 1.92462549e+02 -4.24101624e-01 1.57229678e+02 -1.98485784e+00 -3.03046604e+00 1.49134443e+02
1716.lowfreq: -14.0775 -5.9211 -0.0006 -0.0003 0.0004 5.1412 13.9073 37.1442 40.4578
frequency: 12.2307 36.9541 40.4243 59.0495 65.0663 82.8323 84.1174 96.4244 113.2215 117.3303 125.9431 152.5649 177.9962 215.3441 226.1874 230.2720 234.1982 248.2815 265.8091 281.1375 323.8605 328.6695 359.9968 396.9715 442.3857 481.2097 598.4365 617.5213 665.3088 737.6227 738.1691 738.9455 777.5140 788.9171 796.6210 800.7523 856.1534 889.3468 896.8352 900.5006 905.1575 927.2357 935.1824 958.3076 991.4808 1008.8487 1021.4063 1050.6732 1053.5053 1065.7454 1075.3029 1080.5841 1092.1981 1110.5516 1114.9801 1117.2915 1120.2637 1129.4843 1150.3353 1169.4020 1187.4362 1200.0489 1223.4718 1226.1477 1229.9568 1243.8817 1269.5189 1270.9924 1274.2825 1279.9585 1284.4588 1286.8887 1289.3067 1292.7774 1306.3130 1320.9759 1330.9204 1341.7105 1343.6152 1350.7027 1366.1650 1375.4236 1383.2438 1387.8988 1388.9522 1391.2690 1448.8398 1461.0984 1464.7643 1465.8534 1469.4928 1470.1993 1476.2183 1476.8693 1477.2034 1477.9851 1478.5625 1479.0956 1484.5896 1488.3406 1489.6948 1491.1484 2809.6511 2822.7907 2831.8517 2851.3353 2958.1193 2961.7980 2963.7645 2965.8486 2972.2791 2972.8409 2974.1895 2976.5307 2987.6617 2993.2910 3002.9713 3003.8189 3008.3875 3010.3318 3011.1602 3035.2385 3038.5007 3043.7513 3044.2081 3064.2691 3067.9046 3069.6804 3069.9008 3071.6315 3072.0225 3073.3593
redmass: 3.7666 2.7173 2.8717 1.8483 1.9479 2.2128 1.8968 2.3849 2.4674 2.5568 2.2205 2.5370 2.3730 1.8948 1.4037 1.1501 1.2518 2.2140 2.2813 2.9918 2.8182 2.7729 3.0959 3.0576 2.7571 2.5835 3.2502 3.3142 4.3552 1.1466 1.0766 1.2327 2.1770 1.6871 1.2115 1.5411 1.5308 2.1622 1.7419 1.7205 1.6480 1.3341 1.2104 1.7305 2.6329 3.0682 3.2195 2.8271 2.3259 2.2702 2.2552 2.1820 2.0122 1.9127 1.7857 2.1840 2.1252 2.4580 1.7425 2.0720 1.7407 2.2338 1.3490 1.5237 1.3357 1.5453 1.4267 1.4245 1.2965 1.1468 1.1486 1.1469 1.1158 1.1931 1.2406 1.2959 1.4034 1.4796 1.4805 1.5308 1.4274 1.4076 1.3599 1.2178 1.2468 1.2383 1.0849 1.0800 1.0777 1.0884 1.0704 1.0677 1.0428 1.0435 1.0433 1.0696 1.0667 1.0446 1.0866 1.0857 1.0889 1.0917 1.0723 1.0802 1.0699 1.0713 1.0598 1.0587 1.0585 1.0367 1.0423 1.0379 1.0550 1.0593 1.0598 1.0639 1.0891 1.0956 1.0955 1.0963 1.0912 1.0895 1.1010 1.1028 1.1023 1.0989 1.1021 1.1008 1.1007 1.0994 1.0995 1.1019
irintensity: 0.0016 0.0504 0.0455 0.1438 0.1156 0.0288 0.1493 0.1093 0.7022 0.0838 0.2573 0.7908 1.2020 0.3756 0.1850 0.1516 0.0551 0.0502 0.4639 2.6055 0.8456 3.9673 6.5256 0.0186 4.7921 0.9512 3.3073 3.5613 3.5436 6.2167 7.7432 2.8541 15.6031 2.3872 0.6843 5.0529 7.3640 4.8324 7.7412 14.8380 16.0183 2.0446 1.2312 1.9994 16.0199 10.9047 0.0893 6.3144 13.8609 19.3329 2.2811 5.3971 16.7571 23.3096 16.7121 5.6421 4.5129 23.6930 15.6019 3.1548 21.3285 35.1362 0.8118 8.1353 5.4974 5.4054 16.8005 12.6961 2.0414 0.6699 1.6755 0.8443 0.3450 13.6308 5.2201 20.1752 5.7667 2.2147 0.4780 20.6789 14.8449 1.7395 6.3648 20.4143 0.6119 7.6175 6.5130 1.5801 1.4980 7.1627 0.7333 0.1323 10.3083 13.4135 12.6167 2.6957 8.5535 4.7883 1.3104 15.9703 0.3093 20.3639 43.0948 82.0017 42.6927 218.5794 28.0184 22.1689 21.6370 52.2045 32.3220 28.4693 58.3556 45.5803 14.3145 45.5142 25.1880 17.0745 6.9333 31.0358 9.6724 53.8412 3.2549 43.4569 44.3057 53.4356 79.5054 90.7551 91.6205 49.4513 56.7579 57.8586
temp: 298.150 k
press: 1.00000 atm
elementType: 7 7 6 6 6 6 6 6 6 6 6 6 6 6 6 6 1 1 1 1 1 1 1 1 1 1 1 1 1 1 1 1 1 1 1 1 1 1 1 1 1 1 1 1 1 1
symmnumber: 1
zpe: 1102086.2 jmol-1
zpe.correction: 0.419762 hartree
zpe.thermalcorrener: 0.440179 hartree
zpe.thermalcorrenthalpy: 0.441123 hartree
zpe.thermalcorrgfe: 0.368340 hartree
zpe.sumelectzpe: -659.614247 hartree
zpe.sumelectthermal: -659.593830 hartree
zpe.sumelectthermalent: -659.592886 hartree
zpe.sumelectthermalfe: -659.665670 hartree
dipole: -0.2013 -1.8200 -0.0301
dipole: 1.8313
quadrupole: -102.7721 -105.7720 -100.9819
quadrupole: -0.8963 0.7351 -1.5631
quadrupole: 0.4032 -2.5967 2.1934 -0.8963 0.7351 -1.5631
hfenergy: -660.0340093 hartree
pointgroup: C01 [X(C14H30N2)]
dipole: -0.0932029 0.7143278 -0.0123983 debye
polarizability: 192.4038924|1.2059106|157.0533626|2.2896703|-3.2450521|149.3694156 unknown
InChI: InChI=1S/C14H30N2/c1-4-7-10-15-12-13-16(11-8-5-2)14(15)9-6-3/h14H,4-13H2,1-3H3
charge 0 multiplicity 1
46 atoms
N  -1.111696 -0.025316 -0.391094
N  1.216999 -0.041825 -0.972079
C  0.272314 -0.226038 0.17711
C  -0.960727 0.684264 -1.684901
C  0.368983 0.089076 -2.196907
C  0.403747 -1.605002 0.864718
C  -2.068888 0.572726 0.561177
C  2.206135 1.049778 -0.776771
C  0.238647 -2.802378 -0.09334
C  -3.52432 0.543529 0.051967
C  3.285949 0.692911 0.266851
C  -4.526005 1.093358 1.092859
C  4.350977 1.802794 0.416971
C  0.371195 -4.160688 0.627524
C  -5.980051 1.104855 0.573553
C  5.420318 1.463484 1.477978
H  0.48929 0.568102 0.939422
H  -0.879302 1.794715 -1.55879
H  -1.810426 0.473188 -2.35813
H  0.183583 -0.909572 -2.634826
H  0.865457 0.720409 -2.953254
H  -0.351178 -1.669461 1.677386
H  1.400347 -1.652054 1.349526
H  -2.014016 -0.000413 1.50749
H  -1.78976 1.633492 0.808099
H  2.706115 1.222744 -1.749559
H  1.72535 2.017996 -0.477771
H  1.005253 -2.717689 -0.887704
H  -0.749396 -2.724429 -0.585668
H  -3.608735 1.139259 -0.879247
H  -3.785597 -0.500251 -0.21189
H  2.811422 0.509918 1.2525
H  3.765076 -0.258781 -0.035849
H  -4.467334 0.481631 2.016316
H  -4.228373 2.122554 1.381519
H  4.842412 1.973519 -0.562884
H  3.852956 2.757326 0.685702
H  -0.394771 -4.269582 1.419615
H  0.249014 -5.00492 -0.076556
H  1.363609 -4.263565 1.107289
H  -6.311148 0.085207 0.300613
H  -6.073196 1.739454 -0.32809
H  -6.679547 1.495527 1.335359
H  5.95188 0.528326 1.219458
H  4.958599 1.32088 2.47335
H  6.173839 2.267642 1.566758
