program: Gaussian 09
title: 000052763
version: EM64L-G09RevD.01
frameworkgroup: C1[X(C13H14N2OS)]
method: RPBEPBE
basis: SDD
operation: Freq
keyword: #p
keyword: freq=noraman
keyword: PBEPBE/SDD
title: #p freq=noraman PBEPBE/SDD
converged: YES YES NO NO
title: Mulliken charges:
elementType: S O N N C C C C C C C C C C C C C H H H H H H H H H H H H H H
charge: 0.224057 -0.196164 -0.104553 -0.097302 -0.487563 0.304576 0.113743 -0.356531 -0.340491 -0.199516 -0.170669 -0.234475 -0.158507 -0.214083 -0.605128 -0.323428 -0.659399 0.255268 0.244653 0.239556 0.281401 0.244744 0.249954 0.262036 0.252788 0.263947 0.263973 0.249674 0.235337 0.235154 0.226947
chargesum: 0.00000
title: Mulliken charges with hydrogens summed into heavy atoms:
elementType: S O N N C C C C C C C C C C C C C
charge: 0.224057 -0.196164 -0.104553 -0.097302 0.012357 0.304576 0.113743 -0.116975 -0.059090 -0.199516 0.074075 0.015480 0.103530 0.038705 -0.077208 -0.073754 0.038039
polarizability: 3.14281744e+02 -1.90192307e+01 1.47136102e+02 1.52003830e+00 3.80350400e+00 1.01261775e+02
1716.lowfreq: -9.3563 -4.9785 -1.8075 -0.0027 -0.0022 -0.0019 16.4450 22.5267 30.0504
frequency: 16.0674 22.0792 29.9688 55.3654 66.0046 85.3242 101.7149 106.8821 158.6608 212.3404 235.8117 245.3223 281.2410 293.4526 327.4774 351.7197 402.7198 412.3003 459.0623 519.0324 565.1135 613.8719 621.5630 638.6800 651.3308 667.3660 721.9876 724.7106 744.5607 763.0938 796.1026 803.5303 819.5975 842.2429 850.3071 878.7896 941.2133 967.0386 970.4660 995.4334 998.7804 1004.4325 1014.7990 1035.1345 1057.6120 1069.3782 1075.3814 1108.4666 1126.5315 1170.8671 1200.5200 1225.4605 1238.4658 1248.4571 1270.9500 1275.3531 1308.3197 1315.7063 1348.2815 1358.7119 1365.5327 1401.4572 1418.8753 1435.6631 1458.2184 1462.9202 1471.4353 1480.5711 1482.7597 1486.7315 1550.3897 1592.9555 1613.3685 2982.5977 2991.6587 3015.8979 3049.4557 3081.0810 3086.6594 3107.0332 3137.8189 3138.7945 3162.2361 3166.7766 3225.2094 3227.3243 3257.1042
redmass: 4.4147 4.2999 5.6218 4.7113 3.4875 6.1651 4.3226 2.1550 5.4333 7.1936 1.1611 5.5563 4.4008 4.6582 2.5493 5.1491 2.8852 7.3482 3.4135 7.2308 2.6611 3.1577 6.1319 5.2265 3.3635 5.9019 1.3081 3.7832 5.1698 1.4378 1.1608 5.1422 1.3456 1.4348 1.3266 6.3121 1.6831 2.0032 3.9327 1.8778 1.3909 3.1594 3.2154 1.2081 1.7554 2.3200 3.4783 1.7939 1.3854 1.4527 1.2069 1.5716 2.3331 1.2252 1.8638 1.2766 1.3469 1.6268 3.9933 4.0873 3.2390 1.2005 4.2005 1.7098 1.1435 1.7292 1.0384 2.9398 1.0490 2.3832 6.6268 7.0831 7.5062 1.0625 1.0356 1.0565 1.0975 1.1050 1.0990 1.1052 1.0881 1.0884 1.0956 1.0954 1.0962 1.0928 1.1094
irintensity: 1.2690 3.2571 0.0421 0.4171 4.4165 1.9897 0.2320 0.9657 3.6759 0.3052 0.0942 0.0419 0.8018 4.0154 0.8064 5.4835 0.0176 3.2033 9.2209 28.6142 15.0602 8.3712 0.7056 6.0631 12.0996 13.4542 18.1272 1.3430 25.2197 71.6114 30.1067 4.6156 19.0227 3.9832 25.8853 13.6807 1.5823 18.1897 53.7900 21.3256 0.7397 10.9514 49.0346 0.2923 30.0385 0.6363 138.0173 14.8756 15.3699 3.9870 111.3259 41.3518 198.8229 0.3753 12.0205 31.2126 3.7898 24.3917 3.6033 21.8831 3.0798 19.6520 22.8699 28.0801 33.4358 26.8671 16.5144 16.9941 9.6567 7.9323 103.4909 374.7253 30.6488 54.1808 32.7870 13.5180 5.2524 0.0237 20.9116 39.6933 13.9852 0.5231 8.5598 6.5531 4.6382 2.3685 2.1397
temp: 298.150 k
press: 1.00000 atm
elementType: 16 8 7 7 6 6 6 6 6 6 6 6 6 6 6 6 6 1 1 1 1 1 1 1 1 1 1 1 1 1 1
symmnumber: 1
zpe: 635586.0 jmol-1
zpe.correction: 0.242082 hartree
zpe.thermalcorrener: 0.258645 hartree
zpe.thermalcorrenthalpy: 0.259589 hartree
zpe.thermalcorrgfe: 0.194021 hartree
zpe.sumelectzpe: -1085.320350 hartree
zpe.sumelectthermal: -1085.303787 hartree
zpe.sumelectthermalent: -1085.302843 hartree
zpe.sumelectthermalfe: -1085.368411 hartree
dipole: 8.4077 -3.4408 1.8558
dipole: 9.2722
quadrupole: -133.0289 -103.9888 -108.1117
quadrupole: -9.0010 -9.7623 0.7786
quadrupole: -17.9858 11.0543 6.9314 -9.0010 -9.7623 0.7786
hfenergy: -1085.5624321 hartree
pointgroup: C01 [X(C13H14N2O1S1)]
dipole: 3.3407086 1.4515383 -0.2007384 debye
polarizability: 314.4290301|15.1544409|140.4322996|10.5394311|16.4302756|107.8182923 unknown
InChI: InChI=1S/C13H14N2OS/c1-2-17-12-5-3-11(4-6-12)13(16)9-15-8-7-14-10-15/h3-8,10H,2,9H2,1H3
charge 0 multiplicity 1
31 atoms
S  4.955678 -0.747444 0.044117
O  -1.821755 -1.686331 -0.466807
N  -3.414164 0.581941 -0.033479
N  -5.559539 0.547144 0.709312
C  -1.962949 0.718146 -0.013163
C  0.291725 -0.568317 -0.149425
C  -1.198251 -0.615274 -0.227046
C  1.025609 0.624732 0.09349
C  1.016405 -1.782732 -0.327182
C  3.141708 -0.603407 -0.019002
C  2.432505 0.612133 0.158065
C  2.416119 -1.804442 -0.262879
C  -4.213937 0.251685 -1.136314
C  -4.274782 0.743159 1.0562
C  5.520237 1.031972 0.379212
C  -5.526888 0.23892 -0.662793
C  7.053362 1.044279 0.458971
H  -1.637593 1.43794 -0.790436
H  -1.669023 1.147765 0.962333
H  0.511217 1.581674 0.234263
H  0.448754 -2.700337 -0.513586
H  2.963061 1.549921 0.345439
H  2.955523 -2.748097 -0.400035
H  -3.79108 0.031659 -2.112386
H  -3.917595 1.001272 2.051098
H  5.156105 1.667248 -0.446064
H  5.066842 1.361526 1.329508
H  -6.440101 0.023228 -1.212137
H  7.420299 0.398344 1.275676
H  7.510049 0.702094 -0.486142
H  7.40606 2.073298 0.654293
