program: Gaussian 09
title: 000052805
version: EM64L-G09RevD.01
frameworkgroup: C1[X(C13H20F3N2)]
method: RPBEPBE
basis: SDD
operation: Freq
keyword: #p
keyword: freq=noraman
keyword: PBEPBE/SDD
title: #p freq=noraman PBEPBE/SDD
converged: YES YES NO NO
title: Mulliken charges:
elementType: F F F N N C C C C C C C C C C C C C H H H H H H H H H H H H H H H H H H H H
charge: -0.139138 -0.203135 -0.148866 -0.113016 -0.239880 -0.103509 -0.565726 -0.533940 -0.547656 -0.550258 -0.705373 0.522476 -0.474122 -0.426541 0.278412 -0.196557 -0.375873 0.259229 0.233829 0.299239 0.235647 0.237594 0.313743 0.256632 0.258178 0.263918 0.254450 0.309791 0.272828 0.264589 0.268206 0.232969 0.233488 0.258864 0.277471 0.253890 0.255593 0.282553
chargesum: 1.00000
title: Mulliken charges with hydrogens summed into heavy atoms:
elementType: F F F N N C C C C C C C C C C C C C
charge: -0.139138 -0.203135 -0.148866 -0.113016 0.059359 0.130320 -0.092485 0.294613 0.280502 0.255366 0.019948 0.522476 -0.196651 -0.172651 0.278412 0.059037 -0.093320 0.259229
polarizability: 1.69467374e+02 -6.36457902e+00 1.52694851e+02 1.62922726e+01 8.76769368e+00 1.28303206e+02
1716.lowfreq: -3.8921 -0.0007 -0.0006 0.0010 7.1414 17.7411 24.8903 30.8757 35.5387
frequency: 24.2568 30.4435 35.5297 56.4927 74.9131 105.2888 134.9405 156.4327 173.9420 190.2648 207.6324 224.3813 253.0981 268.3594 276.9135 300.1738 308.0136 324.0929 347.8566 360.3208 366.4945 391.1386 403.7698 431.8865 445.5123 455.5754 476.8565 517.0033 520.0401 571.6414 589.1484 607.2085 636.9133 698.5614 709.1202 735.0083 814.0919 845.8304 857.0872 877.7170 899.6961 904.3436 913.3426 930.7735 932.2672 937.1460 951.1971 989.9345 1002.7054 1025.1226 1037.3509 1045.7343 1080.7267 1086.2827 1097.6197 1104.0989 1115.0967 1134.8300 1190.4891 1193.3721 1205.7498 1217.7427 1235.4620 1242.0042 1263.0645 1295.7028 1318.6326 1321.3376 1339.5500 1390.0186 1400.1824 1411.6580 1414.5608 1438.8000 1442.5799 1448.8049 1454.8536 1461.1044 1462.7286 1464.1342 1468.9102 1477.6481 1482.2813 1483.9214 1496.8135 1500.5926 1599.7034 1620.4627 2985.1351 3002.5759 3018.5617 3022.6101 3025.5951 3038.2304 3065.5897 3080.3702 3094.2240 3129.9176 3137.4647 3141.7784 3152.0772 3153.7841 3160.0043 3160.7008 3161.1509 3170.7641 3179.4985 3383.6965
redmass: 5.0489 8.1798 4.5786 3.4053 3.4287 3.6256 6.3177 2.7782 1.3426 1.5602 1.7002 2.6115 2.0837 1.3631 1.0911 2.9894 5.1296 7.8152 2.9388 2.7866 3.1771 3.5557 2.4574 5.1517 2.2695 2.5215 3.6392 6.1847 3.4173 4.8578 2.8161 11.5664 6.0484 5.9601 2.2171 3.4802 1.6169 2.4331 2.0595 2.6456 1.8077 2.3631 1.7697 2.1905 2.0631 3.1433 2.0536 6.2050 1.3561 4.8736 2.1980 1.2021 2.8015 1.7559 1.5180 1.8231 1.6891 1.8097 1.1619 1.3270 1.8102 1.7800 1.8531 1.7739 1.3488 2.5031 1.2863 1.7702 1.2595 8.0465 1.1959 1.1246 1.1439 2.1963 1.2465 1.1100 1.0671 1.0538 1.0837 1.0599 1.0627 1.0595 1.0699 2.4144 1.0494 1.1473 6.2762 6.1867 1.0378 1.0625 1.0819 1.0316 1.0321 1.0329 1.1025 1.0997 1.0991 1.0903 1.1055 1.1046 1.1053 1.1046 1.0918 1.1063 1.0917 1.1062 1.0985 1.0759
irintensity: 2.0680 0.4919 4.9132 2.6431 0.2938 1.5964 0.0926 1.9713 0.5137 0.1874 1.4342 2.2301 0.8950 0.1626 0.1290 0.3201 1.2282 4.9761 1.5901 1.2629 2.0022 0.3446 5.4766 1.7846 11.3876 1.0011 2.4775 1.2013 3.0535 2.5763 60.9228 14.2036 3.5873 2.9457 37.1423 10.9971 68.3820 23.1401 10.6924 8.7807 13.1929 9.3599 61.3036 38.2408 47.3079 34.2329 57.4565 3.8762 1.2098 141.9595 34.6162 0.8402 52.6797 18.3884 13.2897 23.9478 12.5448 28.3750 5.3451 7.5761 73.2037 4.5992 7.9183 1.6226 6.3246 159.3365 7.0343 48.3248 8.8303 0.5223 19.1253 14.4824 17.0056 20.7717 15.4000 13.7456 2.7576 15.8543 6.7308 4.6232 6.3855 36.6338 13.0635 6.6362 73.8819 25.9212 3.7812 3.6197 11.3232 11.0027 16.7393 0.9712 4.9112 8.1379 4.0548 26.6881 16.2209 5.4380 0.3074 4.6769 1.3824 3.5716 4.4647 1.8246 0.5672 6.3656 2.2869 6.9121
temp: 298.150 k
press: 1.00000 atm
elementType: 9 9 9 7 7 6 6 6 6 6 6 6 6 6 6 6 6 6 1 1 1 1 1 1 1 1 1 1 1 1 1 1 1 1 1 1 1 1
symmnumber: 1
zpe: 825416.2 jmol-1
zpe.correction: 0.314384 hartree
zpe.thermalcorrener: 0.333644 hartree
zpe.thermalcorrenthalpy: 0.334588 hartree
zpe.thermalcorrgfe: 0.266191 hartree
zpe.sumelectzpe: -914.739614 hartree
zpe.sumelectthermal: -914.720355 hartree
zpe.sumelectthermalent: -914.719411 hartree
zpe.sumelectthermalfe: -914.787808 hartree
dipole: -12.5708 -1.6450 2.9364
dipole: 13.0136
quadrupole: -72.1482 -82.3107 -94.5446
quadrupole: 16.6040 3.8597 -0.3055
quadrupole: 10.8530 0.6905 -11.5435 16.6040 3.8597 -0.3055
hfenergy: -915.0539985 hartree
pointgroup: C01 [X(C13H20F3N2)]
dipole: -5.0702161 0.3895006 0.5957505 debye
polarizability: 162.2947543|-7.5974066|156.395307|22.0604787|2.1977259|131.7753699 unknown
InChI: InChI=1S/C13H20F3N2/c1-10(17-18(2,3)4)8-11-6-5-7-12(9-11)13(14,15)16/h5-7,9-10,17H,8H2,1-4H3
charge 1 multiplicity 1
38 atoms
F  3.437898 -1.799601 0.866704
F  1.295941 -2.450821 0.445786
F  2.64743 -1.818058 -1.260765
N  -2.744149 -1.052934 0.336538
N  -2.295707 -0.195361 -0.813447
C  -2.419582 1.307416 -0.690572
C  -1.091821 1.942805 -1.225544
C  -1.835937 -0.798289 1.539709
C  -2.522756 -2.496548 -0.125739
C  -4.212434 -0.85147 0.734678
C  -3.645046 1.85238 -1.458778
C  0.12097 1.562848 -0.395886
C  0.762397 0.321354 -0.606137
C  0.59572 2.402967 0.646163
C  1.808713 -0.09817 0.247511
C  1.67361 2.00115 1.467718
C  2.276592 0.736365 1.28685
C  2.326018 -1.495779 0.074489
H  -2.507186 1.566074 0.381424
H  -2.803833 -0.544935 -1.644925
H  -1.233313 3.039257 -1.227983
H  -0.963293 1.632475 -2.279463
H  -0.79551 -0.946103 1.222044
H  -1.979485 0.228028 1.904507
H  -2.110796 -1.515413 2.328333
H  -2.796618 -3.17558 0.695691
H  -3.16049 -2.696415 -1.001589
H  -1.460832 -2.611765 -0.385203
H  -4.360264 0.194601 1.039129
H  -4.850706 -1.091266 -0.129404
H  -4.452533 -1.519257 1.576864
H  -4.598103 1.434542 -1.088996
H  -3.56342 1.628621 -2.539307
H  -3.703009 2.950016 -1.359233
H  0.432843 -0.326683 -1.423705
H  0.131672 3.38358 0.8077
H  2.042745 2.669584 2.251599
H  3.096273 0.408686 1.933038
