program: Gaussian 09
title: 000052783
version: EM64L-G09RevD.01
frameworkgroup: C1[X(C24H31N)]
method: RPBEPBE
basis: SDD
operation: Freq
keyword: #pfreq=noraman
keyword: PBEPBE/SDD
title: #p freq=noraman PBEPBE/SDD
converged: YES YES NO NO
title: Mulliken charges:
elementType: N C C C C C C C C C C C C C C C C C C C C C C C C H H H H H H H H H H H H H H H H H H H H H H H H H H H H H H H
charge: -0.095506 0.024964 -0.451666 -0.437163 -0.196982 -0.458241 -0.427728 -0.380432 -0.369163 -0.462930 0.397734 -0.594337 -0.647861 0.335055 0.384362 -0.789621 0.358810 -0.454850 -0.390269 -0.438574 -0.249464 -0.394907 -0.261192 -0.242421 -0.252687 0.162526 0.235657 0.190647 0.208021 0.208296 0.185932 0.193187 0.214348 0.212212 0.188265 0.166905 0.205247 0.188011 0.204752 0.230567 0.200866 0.207319 0.215338 0.240234 0.215804 0.183763 0.207136 0.223915 0.230914 0.221329 0.231595 0.225350 0.223976 0.224914 0.223993 0.224047
chargesum: 0.00000
title: Mulliken charges with hydrogens summed into heavy atoms:
elementType: N C C C C C C C C C C C C C C C C C C C C C C C C
charge: -0.095506 0.187491 -0.025362 -0.020846 -0.011051 -0.050705 -0.027251 -0.008280 0.023600 -0.031496 0.397734 -0.171680 -0.008060 0.335055 0.384362 -0.358570 0.358810 -0.223936 -0.168940 -0.206979 -0.024114 -0.170931 -0.036277 -0.018428 -0.028640
polarizability: 2.93841042e+02 1.36265614e+01 2.48286488e+02 1.80133138e+01 -1.50815509e+01 2.22025818e+02
1716.lowfreq: -15.6349 -7.7109 -1.2031 -0.0007 0.0002 0.0005 12.0859 26.9104 31.7998
frequency: -11.7609 26.3984 31.7532 52.3768 66.5092 73.7958 108.2406 122.0793 131.2031 132.8475 174.5787 180.4229 212.1084 220.0691 240.3699 272.5232 280.8924 284.4287 318.7399 325.8051 345.0285 362.2474 398.4707 414.5687 421.9586 430.5349 444.8789 454.9814 464.4393 500.0442 503.9792 516.6974 546.4950 562.2106 566.6098 592.5858 614.9232 628.7904 685.5082 720.5593 731.3229 749.4745 755.7584 762.7390 764.7684 782.3829 815.7541 825.3912 833.2395 850.0316 867.4036 876.0955 878.9776 881.5746 903.4243 922.8436 922.9808 944.5987 949.8058 952.8575 965.6489 984.1593 985.1820 999.6941 1022.5337 1036.8572 1039.0605 1047.0031 1050.3927 1061.8042 1077.5627 1082.4430 1086.2549 1097.4728 1105.3928 1113.2094 1126.9999 1133.9950 1148.1988 1161.7976 1171.4327 1173.7087 1175.3816 1182.2953 1186.4607 1196.6415 1203.6408 1215.1780 1228.3206 1247.5028 1250.0285 1258.1390 1260.9938 1270.4185 1278.5515 1290.1863 1295.4744 1302.3660 1309.5493 1314.0656 1325.4704 1338.6621 1340.4646 1344.2222 1345.8162 1352.8071 1356.4648 1368.7049 1371.2738 1383.6078 1392.4945 1432.2818 1433.0627 1436.5764 1447.7710 1454.6075 1455.5331 1458.1721 1464.3057 1468.3082 1471.8547 1476.9040 1481.3891 1482.8958 1485.1189 1488.0017 1499.9266 1584.1337 1590.6367 1605.9890 1611.4134 2770.7306 2812.9136 2849.4473 2943.8890 2956.3007 2962.6034 2966.8267 2978.4081 2981.4875 2983.3205 2983.6653 3010.9236 3018.8338 3027.3914 3028.5658 3030.1289 3032.0884 3032.9726 3043.8247 3051.7069 3057.4784 3074.0182 3087.6620 3109.0027 3111.2874 3113.5951 3116.6365 3135.0645 3135.6994 3157.8104 3158.4042
redmass: 3.3098 3.9709 4.8700 4.5224 3.0400 4.1182 2.6440 3.4105 3.2270 3.8876 2.0880 2.5599 4.1400 1.5829 2.0402 3.3922 2.1130 3.8379 1.8699 2.7839 3.1063 3.0550 2.1639 2.2799 3.3501 2.3762 2.8886 3.2834 3.5442 2.5217 3.6092 3.1405 2.2041 2.9718 2.8148 5.0485 3.9932 2.8894 3.6851 3.6026 3.0798 2.0645 2.7915 1.8650 1.4912 1.5586 1.6538 2.4651 2.4407 2.2941 1.6782 2.3059 2.1236 1.6124 1.6906 2.5583 1.7931 1.6609 1.7318 1.4792 2.1523 1.3311 1.3251 1.5753 2.0846 3.0238 2.1537 2.4199 2.4099 2.0618 2.0311 2.0301 1.9730 2.3779 1.7499 1.5671 1.8872 1.8654 1.6342 1.1923 1.4729 1.1241 1.1366 1.7605 2.2637 1.5585 1.8297 1.9380 2.2380 1.4409 1.6304 1.2456 1.2874 1.3174 1.3533 1.3299 1.3820 1.2645 1.2975 1.2556 1.2537 1.3995 1.4318 1.4851 1.5508 1.5399 1.5308 2.2727 1.3966 5.3309 1.7958 2.0068 1.2107 2.2414 1.0900 1.0895 1.0893 1.0833 1.1024 1.0911 1.1065 1.0809 1.0967 2.2217 2.3946 1.0534 1.1289 6.4531 6.6157 6.1463 6.3723 1.0790 1.0702 1.0582 1.0781 1.0665 1.0622 1.0673 1.0613 1.0591 1.0615 1.0620 1.0630 1.0878 1.0976 1.0943 1.0852 1.0844 1.0989 1.1015 1.1031 1.0996 1.0962 1.0990 1.0863 1.0863 1.0888 1.0889 1.0924 1.0927 1.1006 1.1007
irintensity: 0.0472 0.0069 0.0068 0.1510 0.0994 0.0695 0.5164 0.6411 0.3259 0.1991 0.3352 0.2557 1.4182 0.6879 1.2779 0.0634 4.4139 0.4099 1.9198 1.3449 0.6880 0.4713 0.1991 1.4016 0.9695 0.4035 0.2772 4.2843 3.0549 1.1158 6.2935 4.6911 5.7591 6.2700 2.4733 0.5995 14.2971 1.8699 8.5592 1.9684 5.1025 22.9374 17.7773 19.2339 76.0798 5.7476 2.5457 2.9234 1.1413 2.1000 0.7136 1.4762 1.4151 4.2080 2.9635 1.4293 1.4797 1.4940 1.1435 2.7338 11.7377 0.0321 0.0794 12.9666 16.9576 3.8701 19.2493 2.5475 7.5037 6.8524 3.7662 6.6542 1.5654 3.9301 9.6922 10.4747 4.8020 2.7328 2.9994 1.4423 8.0586 0.2493 0.7063 0.1262 3.9181 0.6723 4.1126 2.7774 0.8541 1.4997 6.4421 3.4529 4.1476 13.5404 12.9282 5.3962 5.0786 1.6357 5.7307 0.6956 8.9665 0.9855 1.9846 3.8765 8.2176 11.7256 8.1521 1.6617 5.6453 0.6302 1.5578 4.4990 5.4258 4.6941 7.8232 10.8618 5.7016 13.0457 4.4311 1.1502 18.1587 5.4218 3.5800 29.1709 20.3976 24.0464 13.5353 0.8969 3.0162 1.7861 0.7694 58.8360 103.9884 160.9362 7.3827 25.7728 41.2116 56.8009 31.4324 23.1731 36.5498 40.7667 27.8819 58.6488 30.5205 56.9411 19.1959 36.3130 43.2446 26.2780 84.4008 69.4681 9.3859 42.6078 14.0641 19.5439 2.3166 3.0598 11.7931 47.4431 40.4274 32.1310
temp: 298.150 k
press: 1.00000 atm
elementType: 7 6 6 6 6 6 6 6 6 6 6 6 6 6 6 6 6 6 6 6 6 6 6 6 6 1 1 1 1 1 1 1 1 1 1 1 1 1 1 1 1 1 1 1 1 1 1 1 1 1 1 1 1 1 1 1
symmnumber: 1
zpe: 1286043.2 jmol-1
zpe.correction: 0.489828 hartree
zpe.thermalcorrener: 0.511483 hartree
zpe.thermalcorrenthalpy: 0.512428 hartree
zpe.thermalcorrgfe: 0.439475 hartree
zpe.sumelectzpe: -986.033292 hartree
zpe.sumelectthermal: -986.011637 hartree
zpe.sumelectthermalent: -986.010693 hartree
zpe.sumelectthermalfe: -986.083646 hartree
dipole: 0.7614 -0.6264 0.9483
dipole: 1.3680
quadrupole: -148.9562 -148.8392 -145.0523
quadrupole: -1.3905 5.1546 -2.7300
quadrupole: -1.3403 -1.2233 2.5636 -1.3905 5.1546 -2.7300
hfenergy: -986.5231203 hartree
pointgroup: C01 [X(C24H31N1)]
dipole: -0.2930084 0.2697606 0.3620131 debye
polarizability: 295.0015969|11.2472123|248.4212553|-17.3535221|14.8850681|220.7304957 unknown
InChI: InChI=1S/C24H31N/c1-25-17-7-6-11-23(25)16-15-20-14-13-19-8-2-3-9-21(19)18-22-10-4-5-12-24(20)22/h2-5,8-10,12,20,23H,6-7,11,13-18H2,1H3
charge 0 multiplicity 1
56 atoms
N  -4.748906 -0.197866 0.082068
C  -3.5578 0.686589 0.293343
C  -2.294968 -0.142582 0.640599
C  -3.333977 1.552879 -0.972899
C  0.149841 -0.096644 1.491281
C  -1.02313 0.711912 0.853625
C  -4.586679 2.367079 -1.359688
C  -5.972424 0.591764 -0.223727
C  -5.803024 1.430596 -1.502939
C  1.264079 0.830103 2.083155
C  0.616717 -1.283483 0.629626
C  1.9550 1.900435 1.181881
C  -5.007441 -1.135584 1.19681
C  1.2672 -1.182526 -0.640549
C  3.177535 1.421375 0.409708
C  1.703484 0.145792 -1.267681
C  3.066648 0.609758 -0.756301
C  0.334518 -2.584369 1.129274
C  1.58492 -2.370206 -1.349827
C  4.470456 1.794694 0.859717
C  0.665209 -3.759131 0.421168
C  4.2425 0.203882 -1.434673
C  1.293013 -3.651744 -0.838255
C  5.638549 1.37804 0.183981
C  5.523871 0.578226 -0.975065
H  -3.757437 1.384794 1.157008
H  -2.128116 -0.889429 -0.159756
H  -2.47383 -0.710126 1.574583
H  -3.056251 0.87554 -1.805247
H  -2.484295 2.238937 -0.800145
H  -0.290898 -0.568072 2.395964
H  -1.261529 1.558074 1.534078
H  -0.712459 1.16293 -0.104886
H  -4.407346 2.925667 -2.298384
H  -4.794395 3.120487 -0.571089
H  -6.235104 1.27603 0.62878
H  -6.813896 -0.116234 -0.345279
H  -6.728222 2.009323 -1.691241
H  -5.650988 0.747134 -2.360481
H  2.045871 0.195575 2.543743
H  0.777376 1.380153 2.915404
H  2.278005 2.724732 1.845933
H  1.206318 2.345989 0.497655
H  -4.198009 -1.878299 1.284333
H  -5.941084 -1.688263 0.988231
H  -5.12545 -0.625952 2.188214
H  0.950618 0.929601 -1.084567
H  1.762029 0.011816 -2.363371
H  -0.16381 -2.674176 2.102892
H  2.076362 -2.280984 -2.326883
H  4.558902 2.426624 1.752538
H  0.429196 -4.741735 0.844821
H  4.149603 -0.415359 -2.335725
H  1.551038 -4.548417 -1.412722
H  6.625127 1.680923 0.552689
H  6.420081 0.253833 -1.515823
