program: Gaussian 09
title: 000052774
version: EM64L-G09RevD.01
frameworkgroup: C1[X(C17H16N2O)]
method: RPBEPBE
basis: SDD
operation: Freq
keyword: #p
keyword: freq=noraman
keyword: PBEPBE/SDD
title: #p freq=noraman PBEPBE/SDD
converged: YES YES NO NO
title: Mulliken charges:
elementType: O N N C C C C C C C C C C C C C C C C C H H H H H H H H H H H H H H H H
charge: -0.454920 -0.095060 -0.109544 -0.221984 0.236768 -0.443342 0.187128 -0.386334 0.281085 -0.382707 -0.235113 -0.240834 -0.191265 -0.179245 -0.413407 -0.403590 -0.327754 -0.225020 -0.230155 -0.242882 0.251734 0.249567 0.252768 0.280236 0.252327 0.231544 0.232034 0.263423 0.349490 0.270954 0.247247 0.250297 0.247153 0.232616 0.231851 0.234931
chargesum: 0.00000
title: Mulliken charges with hydrogens summed into heavy atoms:
elementType: O N N C C C C C C C C C C C C C C C C C
charge: -0.105430 -0.095060 -0.109544 0.029750 0.236768 0.058994 0.187128 -0.106098 0.281085 -0.130380 -0.003569 -0.008799 0.072158 0.091709 -0.166160 -0.153293 -0.080601 0.007597 0.001696 -0.007950
polarizability: 2.07657178e+02 2.80384107e+01 2.30338768e+02 2.28379157e+01 -5.31099511e+00 1.30046797e+02
1716.lowfreq: 0.0003 0.0005 0.0007 2.3375 5.6626 9.2058 19.5813 30.5472 38.7922
frequency: 19.5752 30.5082 38.6999 54.9716 72.3208 82.2412 93.9817 117.6486 194.5711 214.6779 272.8755 285.0993 296.8984 301.5612 327.0467 341.3748 394.5376 403.7291 474.3233 507.4259 546.0819 559.6803 603.6891 613.1198 617.7743 624.6604 653.6924 703.2741 709.1626 727.3720 738.6413 759.5115 767.3407 781.7176 782.1035 835.3401 843.6448 857.2521 867.6854 880.6587 892.3451 923.9903 964.9365 977.4865 986.8800 993.5515 995.5127 997.7741 1001.1728 1010.7765 1020.1877 1033.7333 1049.0455 1056.8647 1078.6613 1102.4765 1105.0967 1162.0851 1173.3428 1173.8330 1188.7931 1191.6494 1215.0710 1244.6453 1255.6907 1267.7133 1283.8294 1289.1832 1312.0726 1330.0293 1337.2147 1352.1329 1368.3283 1369.3327 1376.0062 1425.9559 1437.3602 1437.6652 1460.3537 1464.1538 1482.5821 1492.7410 1575.0771 1583.9481 1607.6506 1611.1885 3009.8272 3026.8851 3095.5040 3123.1963 3125.4890 3126.7569 3136.8062 3139.4845 3149.7733 3150.4440 3164.9887 3166.7999 3217.5710 3242.5244 3252.6266 3574.1504
redmass: 5.6298 4.1538 4.2342 4.1439 4.2563 4.5359 4.3644 5.2785 5.1016 4.6307 1.7866 4.1333 2.5649 3.6157 5.3562 2.5386 3.0046 2.8804 3.3829 3.4500 3.7146 3.4228 5.8143 6.7079 5.9449 3.5006 3.3959 4.3874 1.8300 1.2450 4.6683 1.9257 2.3013 1.5943 1.5620 1.5896 2.8350 1.2441 2.7910 6.1108 1.3886 1.3984 1.4105 1.3925 5.9737 2.2354 5.7313 1.3232 1.4856 3.3468 3.4060 2.1383 2.0324 1.7001 1.6214 1.8898 1.7493 1.3316 1.0622 1.0530 1.1292 1.8789 1.5910 1.5445 1.8241 1.8830 1.5837 1.8874 1.3829 1.7300 4.1542 1.6388 6.4169 2.2015 2.4937 2.2435 2.2038 1.8447 1.9473 2.2970 2.4285 2.8344 6.1390 6.3430 6.2777 6.2942 1.0808 1.0638 1.1030 1.0862 1.0869 1.0858 1.0895 1.0916 1.0961 1.0940 1.1005 1.1016 1.0909 1.1026 1.1048 1.0663
irintensity: 0.5029 1.0589 0.4101 0.3595 1.3281 1.3766 0.8022 1.1492 4.7455 0.3975 43.2124 14.3618 63.0846 15.9682 10.0913 9.0632 4.0938 0.0479 4.3160 18.3555 3.2350 7.2111 9.6601 2.8099 2.0562 12.5049 23.0412 2.2896 52.9696 35.9588 2.7818 62.4656 23.6077 27.3464 71.4368 1.2443 10.1552 0.1974 13.0538 9.0834 0.5396 3.0052 5.7091 0.0756 0.1077 25.8771 5.4409 0.4630 5.7082 8.3299 64.6645 8.2379 4.7078 26.2345 5.9932 4.9416 9.6041 7.0127 0.7822 0.0156 0.2799 0.8446 39.0157 19.1421 33.6229 27.9318 3.7734 1.5566 0.2150 8.9544 0.4669 11.5425 0.1198 8.0237 1.2704 10.1421 10.5208 43.4628 12.8353 32.8469 22.7528 1.1706 1.8151 0.8593 2.2182 2.8202 10.6790 29.7476 6.2621 6.3403 1.7930 0.0548 12.6429 6.2460 25.9211 17.0031 36.3713 15.4920 1.8881 4.5469 1.4444 13.9154
temp: 298.150 k
press: 1.00000 atm
elementType: 8 7 7 6 6 6 6 6 6 6 6 6 6 6 6 6 6 6 6 6 1 1 1 1 1 1 1 1 1 1 1 1 1 1 1 1
symmnumber: 1
zpe: 755797.2 jmol-1
zpe.correction: 0.287868 hartree
zpe.thermalcorrener: 0.304957 hartree
zpe.thermalcorrenthalpy: 0.305901 hartree
zpe.thermalcorrgfe: 0.240429 hartree
zpe.sumelectzpe: -840.711555 hartree
zpe.sumelectthermal: -840.694466 hartree
zpe.sumelectthermalent: -840.693522 hartree
zpe.sumelectthermalfe: -840.758994 hartree
dipole: -5.8612 1.5450 0.1196
dipole: 6.0626
quadrupole: -143.9319 -104.4537 -110.6201
quadrupole: 11.7080 2.1068 -2.3340
quadrupole: -24.2633 15.2149 9.0485 11.7080 2.1068 -2.3340
hfenergy: -840.999423 hartree
pointgroup: C01 [X(C17H16N2O1)]
dipole: -2.3745153 -0.0962715 -0.2040666 debye
polarizability: 188.3549849|20.198063|243.2315181|27.7712072|-8.4734744|136.4562403 unknown
InChI: InChI=1S/C17H16N2O/c20-17(12-19-11-10-18-13-19)16-9-5-4-8-15(16)14-6-2-1-3-7-14/h1-11,13,17,20H,12H2
charge 0 multiplicity 1
36 atoms
O  1.392049 -1.985941 1.508497
N  2.667095 0.030115 -0.269524
N  4.746598 0.57553 0.459842
C  0.607888 -1.027385 0.711474
C  -0.769773 -1.581209 0.328534
C  1.465016 -0.763479 -0.550381
C  -1.826679 -0.723526 -0.10969
C  -0.96434 -2.984286 0.321322
C  -1.692581 0.771158 -0.157502
C  -3.044358 -1.308274 -0.546818
C  -2.186538 -3.550052 -0.102278
C  -3.231574 -2.707488 -0.541781
C  2.798104 1.419215 -0.432509
C  3.864851 -0.428535 0.27751
C  -1.492203 1.540975 1.020425
C  -1.803586 1.452743 -1.399693
C  4.082119 1.734171 0.01721
C  -1.389982 2.94804 0.956476
C  -1.698626 2.860727 -1.465918
C  -1.486713 3.613672 -0.288104
H  0.507793 -0.072254 1.260919
H  1.756075 -1.741884 -0.973609
H  0.856239 -0.230293 -1.298837
H  -0.136884 -3.6229 0.647398
H  -3.856161 -0.649013 -0.874636
H  -2.319147 -4.637591 -0.095626
H  -4.18457 -3.133486 -0.874213
H  1.9957 2.028618 -0.842401
H  1.013443 -2.043468 2.421367
H  4.022631 -1.472355 0.53372
H  -1.449176 1.03751 1.993627
H  -1.963028 0.872212 -2.316082
H  4.568585 2.706465 0.046163
H  -1.241209 3.523902 1.876528
H  -1.782367 3.367561 -2.433811
H  -1.405192 4.7050 -0.337701
