program: Gaussian 09
title: 000052828
version: EM64L-G09RevD.01
frameworkgroup: C1[X(C22H26FNO3)]
method: RPBEPBE
basis: SDD
operation: Freq
keyword: #p
keyword: freq=noraman
keyword: PBEPBE/SDD
title: #p freq=noraman PBEPBE/SDD
converged: NO YES NO NO
title: Mulliken charges:
elementType: F O O O N C C C C C C C C C C C C C C C C C C C C C C H H H H H H H H H H H H H H H H H H H H H H H H H H
charge: -0.198908 -0.439598 -0.462530 -0.228598 -0.076196 0.252733 -0.457638 -0.493151 -0.443270 -0.407597 -0.450862 0.251113 -0.338312 -0.452386 0.193737 -0.366152 -0.507600 -0.424181 -0.286106 -0.212127 0.119998 0.293207 -0.310112 -0.320790 -0.387026 -0.372402 0.331277 0.213891 0.204466 0.211255 0.251080 0.194458 0.211757 0.223392 0.185090 0.238317 0.218405 0.193869 0.194044 0.218615 0.238227 0.264826 0.343550 0.224995 0.274068 0.214164 0.229299 0.230758 0.357358 0.255115 0.283991 0.258091 0.260394
chargesum: 0.00000
title: Mulliken charges with hydrogens summed into heavy atoms:
elementType: F O O O N C C C C C C C C C C C C C C C C C C C C C C
charge: -0.198908 -0.096048 -0.105173 -0.228598 -0.076196 0.252733 -0.039281 -0.030816 -0.037056 0.000884 0.005860 0.251113 0.049601 0.004457 0.193737 -0.101327 -0.008537 -0.210017 -0.056807 0.018631 0.119998 0.293207 -0.054997 -0.036799 -0.128935 -0.112008 0.331277
polarizability: 2.73089014e+02 5.40089457e+00 2.63936804e+02 6.00713792e+00 -2.05187304e+01 2.26480431e+02
1716.lowfreq: -16.4178 -3.9161 -0.0006 -0.0003 0.0003 4.3406 9.2282 10.3589 14.3601
frequency: -11.6039 9.2223 14.0694 36.5160 49.9580 59.5898 80.1594 84.3579 95.2080 124.6833 127.5178 145.1718 163.5913 196.9114 216.6621 225.5690 242.7676 265.9947 275.6955 284.5146 286.2390 303.4141 321.7485 331.7375 335.1717 359.0410 365.8265 374.0568 387.8481 411.2157 440.5147 459.9534 465.7272 480.7957 489.0422 505.7862 512.6087 526.1408 553.2488 569.4887 574.5477 582.2643 623.8214 624.2428 682.8042 717.3447 730.6870 738.6361 754.7292 755.9092 789.7897 798.2520 811.4646 812.1954 821.9279 843.5957 847.5947 858.9894 882.3187 914.8477 935.2335 947.5779 951.3598 961.3899 970.0911 976.5408 989.5641 992.2743 997.4921 1006.5821 1015.0114 1027.9097 1052.7836 1055.3763 1069.9258 1081.5866 1096.0832 1104.4661 1119.3370 1128.1479 1135.8352 1146.0782 1153.7640 1155.7609 1162.3401 1175.4348 1185.2893 1188.5271 1200.9228 1206.7512 1225.4115 1232.6086 1243.7251 1266.8271 1270.8226 1281.4120 1293.3782 1300.7221 1305.5262 1313.9219 1322.5893 1331.2508 1336.5387 1355.4516 1360.1849 1366.8331 1370.1640 1379.6005 1384.0024 1392.3307 1408.2550 1430.3816 1435.9542 1448.0770 1463.3346 1463.8938 1471.0527 1475.9973 1481.6427 1489.7392 1492.0978 1494.1486 1569.5404 1591.0239 1600.6321 1609.3922 1611.2249 2835.3680 2845.3320 2858.9393 2943.2818 2984.1327 2996.8785 2998.6859 3002.4359 3009.1731 3009.8177 3018.4515 3036.3697 3051.6028 3066.6775 3080.0836 3091.7224 3105.6856 3138.6464 3154.9498 3156.5083 3159.6875 3176.6002 3178.2439 3179.6967 3540.6878 3570.9762
redmass: 4.9482 7.7086 5.5822 4.9900 5.8545 4.6671 4.9142 5.2530 5.6525 3.6243 3.9047 2.9767 3.2628 4.5438 2.8682 5.8604 3.9428 4.7808 1.9941 3.1193 5.3709 2.8431 2.4696 2.9134 1.2483 1.8140 1.6078 6.3741 2.1422 2.9473 3.0631 3.6337 4.1809 3.2795 3.2366 3.5635 3.3301 3.8123 4.5082 2.2455 3.4976 6.1305 3.6190 5.9055 3.7136 2.4392 2.8106 3.4545 1.3919 4.9658 3.6780 2.0416 1.5951 4.9160 1.3068 1.4178 1.5604 2.5779 2.0859 2.3506 1.5062 1.9542 1.9677 1.6656 2.9405 1.3757 1.3710 2.2632 3.4110 2.3235 2.0671 1.9554 2.2775 2.4379 2.1292 1.9599 2.2059 1.3515 2.4293 2.2959 1.8937 2.1397 1.5933 1.4349 1.3270 1.1193 1.1598 1.5722 2.1440 2.1055 2.5265 2.0052 1.7030 1.1742 1.3639 1.6565 1.2874 1.3778 1.4572 1.5348 1.2986 1.3187 1.3644 1.6126 1.4957 1.3887 1.2272 5.7724 5.0226 1.4590 4.0030 2.2808 1.1020 1.0997 1.0842 1.0848 1.0817 1.0843 1.0980 2.5657 1.5393 1.4137 7.9040 6.1896 7.1745 6.4798 7.1276 1.0721 1.0708 1.0699 1.0632 1.0601 1.0646 1.0872 1.0869 1.0638 1.0697 1.0861 1.0870 1.1025 1.0993 1.0969 1.1002 1.0891 1.0878 1.0886 1.0890 1.0954 1.0964 1.0957 1.0974 1.0656 1.0659
irintensity: 0.5639 0.0149 1.1925 0.3792 1.0195 0.0348 2.2218 0.9402 5.7812 0.7386 0.7040 0.4572 0.5371 0.6479 0.8828 10.9064 5.8897 3.1219 3.6021 5.3899 0.3281 26.6337 21.6026 0.8164 25.5195 83.3323 107.4820 2.7225 5.9896 0.0739 2.3594 3.7395 3.0889 3.8005 2.9669 8.0134 18.3350 11.8384 1.9203 10.2244 5.1639 24.5137 6.5199 2.6297 12.9499 4.9870 7.4219 1.7307 83.4037 4.3266 22.6845 34.3973 3.9921 16.1364 2.5518 1.3502 47.3085 19.1362 24.8822 7.5965 7.0220 11.5347 10.8167 6.8791 97.0508 6.1172 0.5473 12.3331 29.8942 3.2724 8.2534 11.1136 4.5257 25.0443 6.8740 51.9675 0.5772 10.9396 43.8399 9.1560 1.2225 37.4468 81.0646 85.7853 31.7141 4.9067 3.1238 3.6468 5.9995 63.0630 14.1752 37.4328 108.6729 16.2650 3.3397 85.9956 2.5176 38.0860 30.9597 78.4677 3.0699 6.2571 6.8027 62.4808 18.9489 2.1151 8.3320 17.6824 4.5289 2.6489 16.4168 28.6510 18.6550 4.9759 13.5876 4.7227 0.9554 22.2382 8.0825 28.2395 39.7641 2.7211 103.6240 8.3532 69.5617 7.7825 61.6859 53.9977 29.4945 278.3869 93.1409 21.7134 17.2265 21.0850 12.4632 23.6754 30.6814 53.7975 38.3091 26.2224 39.3021 14.4057 28.9714 14.8379 6.3406 6.1773 0.0560 24.5566 4.5212 11.0459 4.7196 3.2488 25.0304
temp: 298.150 k
press: 1.00000 atm
elementType: 9 8 8 8 7 6 6 6 6 6 6 6 6 6 6 6 6 6 6 6 6 6 6 6 6 6 6 1 1 1 1 1 1 1 1 1 1 1 1 1 1 1 1 1 1 1 1 1 1 1 1 1 1
symmnumber: 1
zpe: 1140002.2 jmol-1
zpe.correction: 0.434204 hartree
zpe.thermalcorrener: 0.458810 hartree
zpe.thermalcorrenthalpy: 0.459755 hartree
zpe.thermalcorrgfe: 0.377850 hartree
zpe.sumelectzpe: -1232.175704 hartree
zpe.sumelectthermal: -1232.151097 hartree
zpe.sumelectthermalent: -1232.150153 hartree
zpe.sumelectthermalfe: -1232.232058 hartree
dipole: -2.4515 2.3629 -0.1380
dipole: 3.4077
quadrupole: -170.4873 -161.3284 -149.5852
quadrupole: -19.8879 -17.0730 5.5633
quadrupole: -10.0203 -0.8614 10.8818 -19.8879 -17.0730 5.5633
hfenergy: -1232.6099079 hartree
pointgroup: C01[X(C22H26F1N1O3)]
dipole: -1.0056768 -0.8776964 0.1254751 debye
polarizability: 272.9224356|-5.8510664|259.5122925|-5.0876102|-24.0687338|231.0715203 unknown
InChI: InChI=1S/C22H26FNO3/c23-18-9-7-17(8-10-18)20(26)6-3-13-24-14-11-22(16-25,12-15-24)19-4-1-2-5-21(19)27/h1-2,4-5,7-10,25,27H,3,6,11-16H2
charge 0 multiplicity 1
53 atoms
F  6.877013 -3.267067 1.164664
O  -5.204618 1.830201 0.562681
O  -4.249875 -0.624591 -2.363605
O  3.882308 1.545399 -1.829635
N  -0.420555 2.094273 0.319885
C  -3.048057 0.653048 -0.015437
C  -2.419486 1.015095 1.3640
C  -1.884067 0.608522 -1.060514
C  -1.513732 2.260065 1.310469
C  -0.98379 1.859461 -1.032967
C  -4.102892 1.741794 -0.409155
C  -3.781913 -0.710627 0.033532
C  0.545871 3.221591 0.359321
C  1.870989 2.902968 -0.366884
C  -4.354562 -1.310916 -1.131065
C  -3.961522 -1.423907 1.248733
C  2.540016 1.640587 0.204875
C  -5.028937 -2.553183 -1.078947
C  -4.63714 -2.663631 1.319428
C  -5.170513 -3.23667 0.146382
C  3.654786 1.079409 -0.672013
C  4.482628 -0.065464 -0.148704
C  4.22705 -0.689528 1.102794
C  5.556468 -0.54128 -0.951142
C  5.023271 -1.764638 1.54957
C  6.365119 -1.609924 -0.522095
C  6.076234 -2.197032 0.724221
H  -3.221395 1.197261 2.10463
H  -1.800666 0.167065 1.715448
H  -1.256959 -0.275182 -0.833425
H  -2.291874 0.472542 -2.076054
H  -2.12306 3.174559 1.092847
H  -1.058988 2.413112 2.307639
H  -0.15376 1.706885 -1.745773
H  -1.550546 2.759607 -1.388971
H  -4.485642 1.536541 -1.426683
H  -3.653096 2.74642 -0.394055
H  0.75761 3.434815 1.426304
H  0.104907 4.155282 -0.075466
H  2.548284 3.773117 -0.272958
H  1.709902 2.768424 -1.451265
H  -3.558592 -1.001012 2.172126
H  -5.660867 0.950048 0.592048
H  2.934642 1.837078 1.222495
H  1.750137 0.868096 0.336402
H  -5.446321 -2.983451 -1.999786
H  -4.744265 -3.172391 2.283011
H  -5.69403 -4.197989 0.179056
H  -4.683878 -1.145636 -3.084499
H  3.401542 -0.346416 1.733687
H  5.733465 -0.051165 -1.913831
H  4.841057 -2.260014 2.507394
H  7.196104 -1.986549 -1.125215
