program: Gaussian 16
title: optfreq
version: ES64L-G16RevC.01
method: RwB97XD
basis: 6-31+G(d,p)
operation: Freq
keyword: #N
keyword: Geom=AllCheck
keyword: Guess=TCheck
keyword: SCRF=Check
keyword: GenChk
keyword: RwB97XD/6-31+G(d,p)
keyword: Freq
converged: YES YES YES YES
title: Mulliken charges:
elementType: F N C C C C C C C C C C C C C C C C H H H H H H H H H H H H H H H H H H H H H H H H H H H H H H H H H H H H
charge: -0.718308 -0.935445 0.157134 0.008777 -0.009475 -0.027150 -0.343360 -0.219385 -0.291063 -0.309429 -0.198078 -0.242457 -0.227103 -0.273288 -0.655786 -0.640047 -0.634323 -0.645030 0.177684 0.169657 0.302910 0.162584 0.183278 0.185750 0.321332 0.145557 0.160446 0.275736 0.134236 0.168889 0.171457 0.156296 0.134762 0.162996 0.139424 0.139461 0.211108 0.140615 0.154731 0.157053 0.191798 0.144588 0.157433 0.179534 0.151244 0.145345 0.159649 0.162103 0.160589 0.158832 0.166496 0.148497 0.159101 0.162643
chargesum: 0.00000
title: Mulliken charges with hydrogens summed into heavy atoms:
elementType: F N C C C C C C C C C C C C C C C C
charge: -0.718308 -0.935445 0.504475 0.474270 0.359553 0.439740 0.092822 0.083740 0.036690 -0.011671 0.080806 0.109266 0.084681 0.063098 -0.167574 -0.172950 -0.148405 -0.174789
chargesum: -0.00000
1716.lowfreq: -4.1789 -1.3699 -0.0010 -0.0007 0.0005 4.1063 37.9872 39.2171 45.9115
frequency: 37.9841 39.2015 45.9103 54.1579 57.3281 62.2036 77.1202 78.5009 81.7809 91.3790 103.0483 125.8292 137.7929 155.4088 176.0062 180.5138 207.2283 216.1764 227.3893 244.7892 246.5311 250.3179 250.8619 258.5673 262.6670 308.2942 328.1492 347.7449 370.7630 398.3239 413.0816 462.3543 472.7039 550.8757 561.2101 626.0676 745.9040 752.2334 762.7040 764.7585 798.7008 811.6449 836.9747 838.7501 844.4799 904.8747 919.3009 925.7542 928.0757 933.2226 950.1706 964.7946 982.6617 1008.3603 1031.0518 1039.0831 1061.5184 1067.2528 1069.7525 1078.6703 1086.5691 1091.7643 1095.2217 1104.9172 1141.3785 1143.0139 1146.1400 1163.5303 1189.1773 1207.8646 1211.0176 1221.1032 1272.8880 1282.2531 1285.3116 1296.2298 1311.3837 1316.5635 1322.0478 1332.1077 1338.5363 1347.7015 1352.3241 1357.7425 1362.3203 1371.0773 1385.4025 1401.2333 1407.8897 1409.2812 1416.2179 1421.7362 1430.2827 1430.7409 1432.8102 1433.7908 1452.0118 1458.5274 1483.0796 1495.8586 1500.7597 1504.3945 1505.7895 1506.1833 1507.5069 1508.7739 1509.6055 1511.8139 1511.8972 1512.2619 1512.5395 1513.6569 1517.5120 1518.5509 1519.6779 1524.9653 1527.1157 1537.4126 1562.0595 1576.0274 2738.8577 2900.5668 3025.3109 3030.4771 3037.8139 3046.8780 3048.8908 3049.8798 3050.2251 3051.8406 3053.2077 3056.4042 3057.4682 3062.9581 3076.2362 3088.9824 3096.6194 3099.5868 3102.1719 3103.1502 3105.9646 3109.0349 3111.6077 3120.8069 3127.2168 3128.3526 3132.0396 3133.7731 3136.2151 3136.5347 3140.6794 3142.2270 3145.2505 3145.9377 3159.8702 3161.5223
redmass: 3.4151 3.3366 2.6526 1.9040 2.7063 3.3978 3.5648 1.6477 1.8049 1.8735 3.5503 2.8793 2.8936 2.9253 2.5094 2.5022 2.5250 2.6262 6.1902 1.2412 1.1731 1.1287 1.1827 2.6836 3.4269 2.5882 2.7135 2.3087 3.0079 2.8963 2.9416 2.6613 2.6290 2.8193 2.9840 3.3726 1.1048 1.0877 1.0848 1.0910 2.4699 1.2254 1.2032 1.4274 1.2262 2.0679 1.9108 1.8460 1.7445 1.7823 1.4015 1.4096 1.2161 1.4222 2.2104 2.5687 3.1884 2.9698 2.5946 2.6521 2.3502 2.4104 2.4085 2.2631 2.2119 2.0133 2.1335 2.5782 1.8606 2.0426 1.9690 1.9682 1.2444 1.2807 1.3006 1.2756 1.2681 1.2794 1.3148 1.2829 1.1716 1.1031 1.1012 1.1055 1.0894 1.1872 1.1820 1.3331 1.3370 1.3743 1.3467 1.2922 1.3522 1.3419 1.2988 1.3114 1.3396 1.3548 1.1379 1.1031 1.0898 1.0622 1.0526 1.0583 1.0628 1.0635 1.0553 1.0452 1.0435 1.0417 1.0687 1.0837 1.0926 1.0926 1.1191 1.0942 1.1049 1.0929 1.1328 1.1016 1.0987 1.0832 1.0609 1.0659 1.0646 1.0669 1.0376 1.0604 1.0687 1.0372 1.0646 1.0366 1.0371 1.0989 1.0604 1.1025 1.0894 1.0706 1.0825 1.0749 1.0944 1.0983 1.0959 1.0963 1.0985 1.0978 1.1028 1.0985 1.1025 1.1030 1.1014 1.1017 1.1032 1.1020 1.1050 1.1055
irintensity: 0.2484 0.2674 0.9230 0.0737 1.9841 1.3906 23.6694 1.2643 4.3428 3.2800 13.6540 6.0610 4.1444 1.8428 2.0004 0.9772 0.7645 3.2319 51.4031 0.4323 1.0617 0.2306 2.5588 0.3956 2.5256 1.2744 8.3046 2.9130 22.4705 1.1828 0.9480 0.3510 8.5067 2.2616 3.9202 1.3281 8.8075 3.0983 7.9821 3.4266 2.6957 2.8523 3.5766 6.0471 0.8610 22.8450 11.2188 4.7303 2.2210 12.5981 5.3168 7.5420 0.1443 0.1575 1.9408 1.3258 0.0281 7.6773 7.5225 3.7309 0.2029 5.3555 15.7520 15.4224 0.3534 5.9110 5.0179 0.0192 2.3481 5.6176 4.9855 4.3260 0.7502 2.2925 3.0425 1.5079 0.8776 0.5019 1.3005 1.7674 1.8282 0.8472 3.6285 0.7604 1.4053 4.7358 4.8391 0.7342 1.4971 0.7972 5.6685 7.0062 2.6897 12.4153 5.7713 8.3392 6.7673 10.4226 3.0819 5.1239 2.5966 2.7991 1.5099 2.0826 1.5557 7.3148 3.3116 9.4212 3.0748 10.6061 4.9743 2.4320 10.1345 9.6943 6.2337 3.2066 10.0164 6.8728 29.2631 8.2298 346.6655 329.8545 58.1090 26.6320 26.2131 24.6138 41.9192 15.4157 49.4755 39.9985 25.6998 29.3778 31.6006 23.0024 15.4255 7.9435 4.4905 11.7340 14.5628 25.1432 8.1572 4.0069 8.2813 5.1846 14.2622 5.2432 81.9741 49.4029 23.7840 64.5846 37.9184 40.8728 27.8169 31.5347 30.1464 17.6822
temp: 298.150 k
press: 1.00000 atm
elementType: 9 7 6 6 6 6 6 6 6 6 6 6 6 6 6 6 6 6 1 1 1 1 1 1 1 1 1 1 1 1 1 1 1 1 1 1 1 1 1 1 1 1 1 1 1 1 1 1 1 1 1 1 1 1
symmnumber: 1
zpe: 1341259.4 jmol-1
zpe.correction: 0.510859 hartree
zpe.thermalcorrener: 0.535204 hartree
zpe.thermalcorrenthalpy: 0.536149 hartree
zpe.thermalcorrgfe: 0.455894 hartree
zpe.sumelectzpe: -785.296401 hartree
zpe.sumelectthermal: -785.272055 hartree
zpe.sumelectthermalent: -785.271111 hartree
zpe.sumelectthermalfe: -785.351366 hartree
dipole: -4.9705 -8.1708 -0.4705
dipole: 9.5754
quadrupole: -118.7035 -135.8786 -115.3141
quadrupole: -10.0113 -1.5722 -1.0706
quadrupole: 4.5952 -12.5799 7.9847 -10.0113 -1.5722 -1.0706
hfenergy: -785.8072597 hartree
pointgroup: C01 [X(C16H36F1N1)]
dipole: -1.8831285 -3.2600099 -0.1357604 debye
polarizability: 217.0250968|-0.6203874|194.9705421|0.6923882|0.4028546|188.5146249 unknown
InChI: InChI=1/16C.F.N.36H
charge 0 multiplicity 1
54 atoms
F  1.39740728 2.58396862 0.1095534
N  -0.16859892 -0.25060217 0.00969018
C  0.63902117 -0.84594492 1.13900326
C  -0.88664345 0.97976642 0.54517572
C  -1.1236582 -1.28771335 -0.51668071
C  0.73913749 0.19852834 -1.13926094
C  1.63023212 0.10639556 1.80511661
C  -1.9125071 1.5868831 -0.39833188
C  -2.1738633 -1.81300233 0.45470424
C  1.87599236 -0.74843873 -1.49167544
C  2.77691704 -0.67462545 2.44815766
C  -2.38295185 2.93055673 0.16583103
C  -3.18640154 -2.69376538 -0.2833661
C  2.58336373 -0.23869758 -2.75115063
C  3.7399091 0.24263225 3.19913022
C  -3.41902126 3.60641338 -0.72922824
C  -4.2428526 -3.27555141 0.65356381
C  3.80115471 -1.08398969 -3.11778947
H  1.14969638 -1.71745884 0.72092231
H  -0.0824645 -1.21226789 1.87222198
H  -0.07984389 1.72150618 0.7043085
H  -1.35082648 0.68520255 1.49122383
H  -0.51178555 -2.11302733 -0.89111426
H  -1.61933248 -0.83361315 -1.37717662
H  1.12564641 1.19943497 -0.83233713
H  0.07700647 0.31622712 -2.00093072
H  1.11053658 0.68927888 2.57343354
H  2.00254946 0.86147859 1.09951836
H  -2.78089855 0.93025002 -0.55019883
H  -1.45783834 1.77005949 -1.37780528
H  -2.70543664 -0.98238102 0.93150053
H  -1.71064387 -2.40094102 1.25409054
H  1.53629784 -1.77984751 -1.66533739
H  2.6087612 -0.77891999 -0.67760697
H  3.32602113 -1.21915108 1.66741547
H  2.38220914 -1.43668044 3.1354798
H  -1.50620944 3.57616325 0.28495645
H  -2.80620627 2.77836859 1.16769993
H  -2.65847437 -3.50937389 -0.79379846
H  -3.67606653 -2.10221867 -1.06713601
H  2.88576432 0.8014303 -2.58594166
H  1.87476591 -0.23016159 -3.5893642
H  3.22786426 0.76175496 4.01604233
H  4.14683834 1.00603051 2.52914092
H  4.57415796 -0.32104572 3.62751052
H  -4.31114509 2.98097627 -0.85081886
H  -3.00666639 3.80022463 -1.72520323
H  -3.7373156 4.56493151 -0.30935062
H  -4.80327733 -2.48007643 1.15590261
H  -3.78319139 -3.90026674 1.42668179
H  -4.95850767 -3.89423097 0.10528744
H  3.52013326 -2.12734774 -3.30130435
H  4.54195218 -1.07364952 -2.3111834
H  4.28731974 -0.70474665 -4.0211736
