program: Gaussian 98 g16
title: optfreq
version: ES64L-G16RevC.01
method: RwB97XD
basis: 6-31+G(d,p)
operation: Freq
keyword: #N
keyword: Geom=AllCheck
keyword: Guess=TCheck
keyword: SCRF=Check
keyword: GenChk
keyword: RwB97XD/6-31+G(d,p)
keyword: Freq
converged: YES YES YES YES
title: Mulliken charges:
elementType: C C C C C C C C C C C C C C C C H H H H H H H H B B C C C C C C H H C C C C C C H H C C H C C H C C C C C H C C H C C H C C C H C C C C C C C C H H C C C C C C H H C H C C C C H C C C H C C H C C C C H C C H C C B B S S S S H H H H H H H H H H H H H H H H H H H H H H H H H H H H H H H H H H H H H H H H H H H H H H H H H H H H H H H H H H H H H H H H H H H H H H H H F F F F
charge: -0.911271 -0.362444 -0.024813 -0.947295 -0.947341 -0.348587 -0.038803 -0.932446 -0.912470 -0.362146 -0.024838 -0.947004 -0.946601 -0.348837 -0.038964 -0.931790 0.088244 0.100403 0.088469 0.100602 0.088259 0.100426 0.088465 0.100592 1.193094 1.193090 -0.637700 0.108718 -0.386721 -0.387665 -0.484590 0.613636 0.081794 0.081820 -0.637446 -0.387470 0.108977 -0.484598 -0.387694 0.613476 0.081818 0.081795 0.583114 -0.594602 0.217097 -0.569544 0.827490 0.161138 -0.965993 -0.558435 0.178438 -0.566739 -0.581452 0.112317 0.583751 -0.594536 0.217101 -0.569720 0.827886 0.161120 -0.966137 -0.558436 0.178387 0.112318 -0.566741 -0.581453 -0.643024 -0.330776 0.077926 -0.407565 -0.473610 0.654870 0.081351 0.083478 -0.642739 0.076789 -0.330523 -0.473558 -0.407406 0.654805 0.083481 0.081350 0.766522 0.161243 -0.568282 -0.957944 0.577344 -0.562451 0.217047 -0.587758 0.183695 -0.575913 0.115449 -0.577240 0.767353 0.161215 -0.568169 -0.957733 0.577354 -0.562568 0.217043 -0.587742 0.183740 0.115449 -0.577239 -0.575922 1.200790 1.201549 0.660709 0.627297 0.660959 0.626358 0.156492 0.105344 0.153537 0.154629 0.152839 0.105532 0.139334 0.146886 0.102434 0.115019 0.102396 0.182030 0.130367 0.170166 0.100179 0.170072 0.129872 0.100794 0.181235 0.103030 0.114552 0.147023 0.138835 0.103090 0.201353 0.101301 0.141171 0.151611 0.153709 0.105929 0.152290 0.105621 0.155582 0.142141 0.101342 0.202107 0.115030 0.102396 0.182001 0.130358 0.170177 0.100180 0.201308 0.101289 0.141166 0.147044 0.138824 0.103089 0.152291 0.105621 0.155578 0.151610 0.153711 0.105930 0.154628 0.152836 0.105533 0.156497 0.105344 0.153540 0.142143 0.101342 0.202107 0.139328 0.146895 0.102436 0.170048 0.129877 0.100799 0.181243 0.103029 0.114550 -0.466464 -0.467119 -0.466499 -0.467058
chargesum: -4.00000
title: Mulliken charges with hydrogens summed into heavy atoms:
elementType: C C C C C C C C C C C C C C C C B B C C C C C C C C C C C C C C C C C C C C C C C C C C C C C C C C C C C C C C C C C C C C C C C C C C C C C C C C C C C C B B S S S S F F F F
charge: -0.911271 -0.274200 0.075591 -0.947295 -0.947341 -0.260118 0.061799 -0.932446 -0.912470 -0.273887 0.075588 -0.947004 -0.946601 -0.260373 0.061628 -0.931790 1.193094 1.193090 -0.637700 0.108718 -0.386721 -0.305870 -0.402771 0.613636 -0.637446 -0.387470 0.108977 -0.402780 -0.305899 0.613476 0.800210 -0.195780 -0.168819 0.988628 -0.520401 -0.169776 0.290755 -0.153742 -0.166072 0.800851 -0.195719 -0.168983 0.989005 -0.520547 -0.169782 0.290705 -0.153741 -0.166079 -0.643024 -0.330776 0.077926 -0.326214 -0.390132 0.654870 -0.642739 0.076789 -0.330523 -0.390077 -0.326056 0.654805 0.927765 -0.179334 -0.514118 0.794391 -0.161739 -0.188314 0.299144 -0.162420 -0.165991 0.928568 -0.179212 -0.513970 0.794398 -0.161852 -0.188315 0.299189 -0.165989 -0.162432 1.200790 1.201549 0.660709 0.627297 0.660959 0.626358 -0.466464 -0.467119 -0.466499 -0.467058
chargesum: -4.00002
1716.lowfreq: -0.0068 -0.0064 -0.0020 2.0432 3.5269 3.6033 8.5892 11.4615 14.8360
temp: 298.150 k
press: 1.00000 atm
elementType: 6 6 6 6 6 6 6 6 6 6 6 6 6 6 6 6 1 1 1 1 1 1 1 1 5 5 6 6 6 6 6 6 1 1 6 6 6 6 6 6 1 1 6 6 1 6 6 1 6 6 6 6 6 1 6 6 1 6 6 1 6 6 6 1 6 6 6 6 6 6 6 6 1 1 6 6 6 6 6 6 1 1 6 1 6 6 6 6 1 6 6 6 1 6 6 1 6 6 6 6 1 6 6 1 6 6 5 5 16 16 16 16 1 1 1 1 1 1 1 1 1 1 1 1 1 1 1 1 1 1 1 1 1 1 1 1 1 1 1 1 1 1 1 1 1 1 1 1 1 1 1 1 1 1 1 1 1 1 1 1 1 1 1 1 1 1 1 1 1 1 1 1 1 1 1 1 1 1 1 1 1 1 1 1 9 9 9 9
symmnumber: 1
zpe: 4191227.2 jmol-1
zpe.correction: 1.596354 hartree
zpe.thermalcorrener: 1.692881 hartree
zpe.thermalcorrenthalpy: 1.693826 hartree
zpe.thermalcorrgfe: 1.458186 hartree
zpe.sumelectzpe: -5045.657096 hartree
zpe.sumelectthermal: -5045.560569 hartree
zpe.sumelectthermalent: -5045.559625 hartree
zpe.sumelectthermalfe: -5045.795265 hartree
dipole: 0.0008 -0.0002 -0.3899
dipole: 0.3899
quadrupole: -995.1933 -979.2030 -664.2742
quadrupole: -0.1836 0.0008 -0.0013
quadrupole: -115.6365 -99.6462 215.2827 -0.1836 0.0008 -0.0013
hfenergy: -5047.2534506 hartree
pointgroup: C01 [X(C76H100B4F4S4)]
dipole: -0.000149 0.0008009 -0.1534107 debye
polarizability: 1216.7882802|4.4710534|1192.1050198|0.4109641|1.8151782|833.6551196 unknown
InChI: InChI=1/76C.4B.4F.4S.100H
charge -4 multiplicity 1
188 atoms
C  -1.28736227 3.16899101 0.0412971
C  -0.8992259 3.99155356 -0.99112289
C  0.50525671 3.97123356 -1.27150918
C  1.23734769 3.1346797 -0.46193972
C  3.16438686 1.2849056 -0.0035503
C  3.97852464 0.89277365 1.0340289
C  3.9565168 -0.51288622 1.30832985
C  3.12696339 -1.24195727 0.48885044
C  1.28018108 -3.16772597 0.01222297
C  0.89417879 -3.97953291 -1.02947684
C  -0.50972992 -3.95636379 -1.31248188
C  -1.24350363 -3.12832114 -0.49569947
C  -3.1714979 -1.28326672 -0.02290101
C  -3.98784975 -0.90153251 1.01682558
C  -3.96639598 0.50129321 1.30527132
C  -3.13507357 1.23851043 0.49491461
H  -1.61899687 4.58708749 -1.55113754
H  0.96965323 4.53542379 -2.07693313
H  4.56892427 1.61047363 1.60208859
H  4.51404661 -0.98043133 2.11654012
H  1.61512579 -4.56920959 -1.59415356
H  -0.9724686 -4.51211776 -2.12468817
H  -4.57948417 -1.62487077 1.57638763
H  -4.52564619 0.96072376 2.11693932
B  -2.77067121 2.83443535 0.6316461
B  2.76229577 -2.83917587 0.60884788
C  -3.87898961 3.93872468 0.02232521
C  -4.83311502 3.68180809 -0.99562243
C  -3.92355859 5.23813972 0.59488319
C  -5.87161482 4.58220258 -1.26095207
C  -4.96595715 6.12472511 0.29706995
C  -5.97838449 5.80263391 -0.60066012
H  -6.61004192 4.31910138 -2.01930542
H  -4.98821735 7.10436232 0.77801825
C  3.87171833 -3.9374328 -0.00936924
C  3.91490405 -5.24259627 0.55007836
C  4.8280041 -3.67034494 -1.02264916
C  4.95772997 -6.12632357 0.24536394
C  5.86692069 -4.56817617 -1.29495863
C  5.97207942 -5.79530222 -0.6469393
H  4.97879363 -7.11083728 0.71630329
H  6.60700018 -4.29747774 -2.04901654
C  -2.82171155 5.76671007 1.51620909
C  -3.33207473 6.02218238 2.93888245
H  -2.04971649 5.0034256 1.58577058
C  -2.15316387 7.01650859 0.92689882
C  -4.73861663 2.45751589 -1.89934413
H  -3.7897954 1.97084246 -1.69067094
C  -5.83658065 1.42252689 -1.63311368
C  -4.69936468 2.8493188 -3.38435844
C  -7.12031019 6.76490913 -0.87650073
C  -7.12347139 7.25402308 -2.33254717
C  -8.48181423 6.1567456 -0.50962667
H  -6.96544441 7.64357826 -0.233413
C  2.81113439 -5.78025169 1.46380714
C  3.31866318 -6.050228 2.88482795
H  2.03916191 -5.01754223 1.53961405
C  2.14350161 -7.02384316 0.86052204
C  4.7355567 -2.436898 -1.91404221
H  3.78629319 -1.95233003 -1.70250665
C  5.8329386 -1.4047209 -1.63484911
C  4.69956293 -2.81351197 -3.40306396
C  7.1143777 -6.75496923 -0.93022639
H  6.95800248 -7.64012115 -0.29646308
C  7.1204537 -7.22919238 -2.39118166
C  8.47524514 -6.15089064 -0.55435027
C  -3.94193749 -3.87437408 -0.01651019
C  -5.24680356 -3.91153087 -0.58455542
C  -3.68290378 -4.83505232 0.9907426
C  -6.13504005 -4.95061026 -0.29208971
C  -4.5883654 -5.87374244 1.25164419
C  -5.81023532 -5.97222824 0.59835448
H  -7.11495112 -4.95565002 -0.77200057
H  -4.33223479 -6.6255965 1.99966927
C  3.93466927 3.87585537 0.03044828
C  3.6734831 4.82636199 1.04675563
C  5.24073692 3.91870861 -0.53443912
C  4.57844048 5.86229903 1.32008322
C  6.12838464 4.95472864 -0.22959468
C  5.80171768 5.96729382 0.67045849
H  4.32071985 6.60659911 2.07508533
H  7.10931502 4.9645839 -0.70734406
C  -2.45246098 -4.75515515 1.8872524
H  -1.96136074 -3.80780991 1.68235854
C  -2.83448584 -4.7245738 3.37498763
C  -1.42564854 -5.85712946 1.60624309
C  -5.77601827 -2.79981315 -1.49393164
C  -7.02083299 -2.13229937 -0.89308112
H  -5.01088857 -2.02948319 -1.56089906
C  -6.03968487 -3.29779975 -2.919478
C  -6.76327851 -7.12042533 0.87992599
C  -7.0401784 -7.95589981 -0.37857942
H  -6.27101798 -7.77706157 1.61166729
C  -8.08003951 -6.63725818 1.50600134
C  2.44105654 4.73762834 1.93969816
H  1.95007672 3.79263228 1.72397387
C  2.81986233 4.69155028 3.42784979
C  1.41522058 5.84279427 1.66779956
C  5.77180372 2.81624562 -1.45393942
C  7.01529608 2.14253474 -0.85728158
H  5.00668576 2.04677971 -1.53037512
C  6.03858822 3.32866473 -2.87377026
C  6.7542014 7.11252567 0.96567087
H  6.26041915 7.76173553 1.70299266
C  8.0696221 6.62296803 1.58959525
C  7.03378727 7.9607057 -0.2837097
B  -2.83981088 -2.76312546 -0.62361001
B  2.8338637 2.77071476 -0.59016513
S  -2.37249385 0.1403548 -0.61986602
S  -0.14095067 -2.37094158 0.61823428
S  2.36678324 -0.13269208 -0.61655275
S  0.13249638 2.36586182 0.64189837
H  8.68157599 -5.26158583 -1.16075641
H  9.29066801 -6.871125 -0.71455176
H  8.48111894 -5.84014752 0.49502467
H  7.27623914 -6.38295997 -3.07005512
H  6.16020086 -7.68586793 -2.65057788
H  7.92033555 -7.96235371 -2.57009163
H  4.48241732 -1.92176462 -4.00295852
H  3.91554403 -3.55378511 -3.5955435
H  5.65579218 -3.22921036 -3.75192802
H  -6.37482593 -2.46926574 -3.55795189
H  -6.81552659 -4.0778185 -2.94122314
H  -5.1157275 -3.70437989 -3.33928717
H  -7.33797288 -1.29031489 -1.52127964
H  -6.78999799 -1.73537989 0.10058467
H  -7.86699298 -2.82872884 -0.80333848
H  1.73894792 -6.78857271 -0.12904228
H  1.30682812 -7.34728489 1.49265455
H  2.84221763 -7.86693455 0.76129606
H  3.72481858 -5.12724902 3.30724265
H  4.10121407 -6.82361409 2.89729343
H  2.49509206 -6.39147709 3.52653811
H  -3.56946309 -3.93589044 3.56883105
H  -1.94345391 -4.5172012 3.9794352
H  -3.25869813 -5.6795699 3.71660416
H  -1.0872851 -5.80057468 0.56802089
H  -1.84907759 -6.85561902 1.7933542
H  -0.54472731 -5.72741069 2.24661787
H  -8.61659611 -5.977473 0.81436135
H  -7.88419488 -6.06633293 2.41895251
H  -8.73921548 -7.48231035 1.7523159
H  -7.53512208 -7.34585855 -1.14317124
H  -7.68857111 -8.81516845 -0.15370557
H  -6.10367664 -8.32478186 -0.80819914
H  5.69501056 -0.5222479 -2.27132216
H  6.8328179 -1.82194686 -1.82871297
H  5.78020081 -1.07052674 -0.59508097
H  6.37489054 2.50659219 -3.51993211
H  6.81466654 4.10866107 -2.88590227
H  5.11564349 3.73975156 -3.29141331
H  7.33374185 1.30699759 -1.49337862
H  6.78234013 1.73549669 0.13178084
H  7.86129447 2.83796074 -0.75863476
H  1.0792311 5.79708676 0.62827133
H  1.83847316 6.83917494 1.86621657
H  0.53278869 5.70670388 2.30476193
H  3.55392025 3.90042927 3.6151286
H  1.92742598 4.47855111 4.02825814
H  3.24397178 5.64270505 3.78014153
H  7.53030479 7.35841459 -1.05340812
H  7.68175007 8.81760178 -0.04876765
H  6.09820867 8.33399539 -0.71153028
H  8.60763849 5.97022553 0.8924288
H  7.87182897 6.04280064 2.49627836
H  8.7282868 7.46544803 1.84588528
H  -7.27766235 6.41473754 -3.02034982
H  -6.16278738 7.71352126 -2.58527774
H  -7.92314758 7.98880848 -2.50561769
H  -8.686686 5.27363086 -1.12549903
H  -9.29706782 6.87840916 -0.66415786
H  -8.48978729 5.83530989 0.53650856
H  -5.69721451 0.54657305 -2.27822051
H  -6.83604116 1.84169 -1.82494586
H  -5.78616078 1.07779074 -0.59667825
H  -4.48091287 1.96374018 -3.99285332
H  -3.91492451 3.59149988 -3.56754304
H  -5.6548321 3.26858338 -3.73103448
H  -1.74685723 6.79149455 -0.06432921
H  -1.31764514 7.33351006 1.56380376
H  -2.85180294 7.86050619 0.8351288
H  -3.73883736 5.09489315 3.35114567
H  -4.1148297 6.79524055 2.9576241
H  -2.50984392 6.35710391 3.58562534
F  -2.80359388 3.06327254 2.09636311
F  -3.0754258 -2.78777802 -2.08759558
F  2.79237566 -3.08270922 2.07126272
F  3.07247717 2.81001729 -2.05327945
