program: Gaussian 98 g16
title: opt Trimer -> Freq -> Monoanion
version: ES64L-G16RevC.01
basis: 6-31+G(d,p)
method: UwB97XD
operation: FOpt
keyword: #
keyword: wB97XD/6-31+g(d,p)
keyword: opt
nucrepener: 11530.3797115050
converged: YES YES YES YES
dipole: 0.0315 -0.2879 -0.1431
dipole: 0.3230
quadrupole: -547.9736 -484.1717 -464.3265
quadrupole: -0.1156 -0.0200 0.6206
quadrupole: -49.1497 14.6522 34.4975 -0.1156 -0.0200 0.6206
hfenergy: -4038.965478 hartree
pointgroup: C01 [X(C61H79B3S4)]
dipole: 0.0123137 -0.1135445 -0.0557497 debye
InChI: InChI=1/61C.3B.4S.79H
charge -1 multiplicity 2
147 atoms
C  1.37767703 0.98714009 0.14689602
C  2.62835352 1.63183813 0.18747538
C  3.72144825 0.7708802 0.18180715
C  3.39400517 -0.59392574 0.13711743
C  4.08128245 -3.25955072 0.07303784
C  5.03000493 -4.26595311 0.05416474
C  4.4937698 -5.57970269 0.01530958
C  3.12356483 -5.57400702 0.00446362
C  -3.20756423 -5.52036637 -0.07022691
C  -4.57732456 -5.50231676 -0.10216239
C  -5.09143077 -4.17920084 -0.09204933
C  -4.12630424 -3.18912701 -0.05247767
C  -3.39500945 -0.5353863 0.01469324
C  -3.6997966 0.83539578 0.03422989
C  -2.59295908 1.67725154 0.07697074
C  -1.3529437 1.01082046 0.09321273
H  2.70316082 2.71388881 0.21935864
H  4.75516695 1.10273014 0.20863084
H  6.09190496 -4.04427994 0.06873075
H  5.0903406 -6.48458571 -0.00365606
H  -5.18878864 -6.39692611 -0.13156021
H  -6.14922259 -3.93914151 -0.11282901
H  -4.72771672 1.18537673 0.01644292
H  -2.65005778 2.76069285 0.09620551
B  0.01784845 1.69023012 0.1370981
C  0.02995979 3.28768342 0.17011948
C  0.06492254 4.03220146 -1.02569984
C  0.00301098 3.98482895 1.39115425
C  0.07161135 5.42693833 -0.9853014
C  0.00890986 5.38297133 1.40176893
C  0.04321305 6.12362639 0.22320053
H  0.09915884 5.9851031 -1.92027527
H  -0.01422731 5.9136084 2.35314976
C  -0.03812349 3.22607774 2.71027819
C  -1.34472333 3.48592829 3.47031503
H  -0.01145532 2.15762912 2.47011051
C  1.19011339 3.52423298 3.57881463
C  0.09552674 3.32283995 -2.37260136
H  0.08136358 2.24599975 -2.17260659
C  -1.14844919 3.64258057 -3.21066016
C  1.38825433 3.62206448 -3.14162027
C  0.04944897 7.64194689 0.25722535
C  1.3329826 8.2190382 -0.35522856
C  -1.19398173 8.23100228 -0.42282499
H  0.02264346 7.94183382 1.31329533
C  -5.95347856 -1.24213545 -0.06627492
C  -6.60683351 -1.02226354 -1.29284328
C  -6.67330583 -1.07143146 1.12717746
C  -7.94542484 -0.63018082 -1.30806059
C  -8.01412589 -0.67885359 1.0809496
C  -8.66786406 -0.45121316 -0.12750915
H  -8.4366325 -0.45419041 -2.26366243
H  -8.56623727 -0.54009471 2.00949183
C  5.94126577 -1.34523664 0.14045129
C  6.62330361 -1.20235246 1.35942931
C  6.63947069 -1.12243671 -1.06063093
C  7.97176601 -0.83400263 1.36326151
C  7.98464573 -0.7549224 -1.02588358
C  8.6699318 -0.6037327 0.1804235
H  8.49460012 -0.71682562 2.31151603
H  8.51097229 -0.57647857 -1.96213673
C  -5.99449214 -1.29117092 2.47210864
H  -4.98348872 -1.66559947 2.27460933
C  -5.83962852 0.02704578 3.24071868
C  -6.7099957 -2.35540202 3.31269007
C  -5.8508277 -1.18669266 -2.6043578
C  -5.6304752 0.1665623 -3.2919627
H  -4.85945314 -1.58899547 -2.36629337
C  -6.52862433 -2.19293326 -3.54193072
C  -10.12316881 -0.01778721 -0.15512974
C  -11.01086187 -1.05094007 -0.86227969
H  -10.46020083 0.04999196 0.88764981
C  -10.28930112 1.37107768 -0.78669097
C  5.89562043 -1.425844 2.67789556
H  4.88450677 -1.77696445 2.44185033
C  6.56135389 -2.51540422 3.52686347
C  5.74147569 -0.11494031 3.45902429
C  5.92567298 -1.25777005 -2.39887317
C  6.61544063 -2.26755913 -3.32384884
H  4.91899855 -1.64262006 -2.19927497
C  5.75554596 0.10665493 -3.07857915
C  10.13292088 -0.19694187 0.20714548
H  10.43575401 -0.14813944 1.26141794
C  11.02516381 -1.2376085 -0.48306279
C  10.34529271 1.19622829 -0.40063242
B  -4.415594 -1.65524674 -0.03260791
B  4.39622081 -1.73124777 0.11680875
S  -1.65527686 -0.70238571 0.05295043
S  -2.5532799 -3.93464333 -0.02805012
S  2.4956726 -3.97759888 0.04142112
S  1.65161903 -0.73058556 0.10394623
H  -5.92142107 -2.34692986 -4.44073136
H  -7.5164515 -1.84213896 -3.86308266
H  -6.65711816 -3.15997192 -3.04550211
H  -5.05094715 0.04252155 -4.21351927
H  -5.08162214 0.84707883 -2.63423136
H  -6.58680106 0.63650722 -3.55146883
H  -5.26641779 0.74979008 2.65238682
H  -5.31184629 -0.13681298 4.18681395
H  -6.81740098 0.46820085 3.4685179
H  -6.7849271 -3.29813663 2.76146725
H  -7.72392444 -2.03869996 3.58394359
H  -6.15938093 -2.54408012 4.24088668
H  -9.98454825 1.36093197 -1.83914962
H  -9.67290671 2.11220509 -0.26921007
H  -11.33498073 1.69690026 -0.74278397
H  -10.73204643 -1.14887862 -1.91745834
H  -12.06505263 -0.7535447 -0.81969102
H  -10.9094841 -2.03669783 -0.39815247
H  5.20556862 0.00374508 -4.02061115
H  6.72917549 0.56014016 -3.30025271
H  5.19790068 0.79111361 -2.43245339
H  6.03671446 -2.39986675 -4.24462115
H  6.70760487 -3.24214797 -2.83415145
H  7.62050526 -1.93331634 -3.60691225
H  5.20354399 0.62720267 2.86161234
H  6.71963481 0.3028116 3.7258928
H  5.17853411 -0.28023334 4.38437064
H  6.63490138 -3.45238317 2.96573281
H  5.97703485 -2.70440317 4.43415432
H  7.57217765 -2.22335363 3.83487568
H  10.07615327 1.20454513 -1.46276954
H  11.39458905 1.5021502 -0.31747501
H  9.72521572 1.94222789 0.10531991
H  10.78033559 -1.31753295 -1.54814635
H  10.89047229 -2.22690118 -0.03521778
H  12.08250615 -0.96024052 -0.40142629
H  1.40609053 7.9655542 -1.41879474
H  2.21926063 7.81601588 0.14411623
H  1.35088273 9.31181679 -0.26784092
H  -1.21249562 7.97804121 -1.48886429
H  -1.20623001 9.32391429 -0.33615226
H  -2.10947178 7.83645014 0.02824944
H  -1.13713185 3.07638803 -4.14898613
H  -1.19882552 4.70929321 -3.46114168
H  -2.05866554 3.37798879 -2.66356322
H  1.41820663 3.05700579 -4.08022907
H  2.26284921 3.34140381 -2.54653932
H  1.47003227 4.68806896 -3.38684567
H  2.11114035 3.29223911 3.03499348
H  1.17137055 2.91937496 4.49256605
H  1.22540862 4.57974677 3.87476182
H  -2.20756989 3.21616027 2.85344295
H  -1.4405116 4.54253765 3.74880909
H  -1.3821139 2.88964959 4.38919016
H  2.45745608 -6.42612042 -0.02330361
H  -2.55594264 -6.38405309 -0.06948469
