program: Gaussian 98 g16
title: opt Trimer 180_0_180_180_0_180
version: ES64L-G16RevC.01
basis: 6-31+G(d,p)
method: RwB97XD
operation: FOpt
keyword: #
keyword: wB97XD/6-31+g(d,p)
keyword: opt
nucrepener: 11990.8077429835
converged: YES YES YES YES
title: Mulliken charges:
elementType: C C C C C C C C C C C C C C C C H H H H H H H H B C C C C C C H H C C H C C H C C C C C H C C C C C C H H C C C C C C H H C H C C C C H C C C H C C H C C C C H C C H C C B B S S S S H H H H H H H H H H H H H H H H H H H H H H H H H H H H H H H H H H H H H H H H H H H H H H H H H H H H H H H H
charge: -0.204880 -0.263737 0.157518 -0.327453 0.502600 -0.537313 0.066615 -0.225194 -0.224570 0.062129 -0.547820 0.534369 -0.436280 0.198214 -0.222791 -0.179627 0.162626 0.121976 0.165813 0.165087 0.165096 0.165338 0.121770 0.162566 0.078917 -0.630662 -0.101610 -0.097433 -0.179652 -0.243967 0.395781 0.128665 0.129423 0.356329 -0.518286 0.127021 -0.428247 0.406180 0.126798 -0.424579 -0.516429 0.299948 -0.532094 -0.529026 0.130672 -1.098170 0.083739 -0.205759 -0.240054 -0.337729 0.517464 0.126745 0.122398 -1.075077 0.013991 -0.187209 -0.385660 -0.196216 0.484999 0.126840 0.123304 0.255539 0.126460 -0.522105 -0.446356 0.264280 -0.515965 0.122681 -0.454477 0.138846 -0.532261 0.130011 -0.505849 0.240465 0.122855 -0.465505 -0.507689 0.209406 -0.438774 0.126445 -0.517123 0.305835 0.128399 -0.516217 -0.591251 -0.271476 -0.219849 -0.078963 0.274872 0.272399 -0.090266 0.148151 0.151794 0.155229 0.147119 0.161077 0.148354 0.150126 0.142587 0.141968 0.151374 0.150205 0.147145 0.151410 0.148413 0.147939 0.152225 0.149115 0.155593 0.143347 0.141923 0.149865 0.147561 0.151701 0.149039 0.161166 0.148996 0.146792 0.155409 0.148165 0.152127 0.152672 0.149400 0.150723 0.152591 0.155892 0.147494 0.152750 0.156823 0.150538 0.152676 0.150640 0.156946 0.151642 0.149259 0.154305 0.147663 0.158540 0.151594 0.154285 0.151615 0.149799 0.158366 0.151857 0.147488 0.185394 0.185359
chargesum: -0.00000
charge: 0.336026 -0.483406 -0.222084 0.070192 0.461297 -0.570653 0.107005 -0.204724 -0.201988 0.065481 -0.405404 0.294517 -0.281472 0.199292 -0.309842 -0.282896 0.161414 0.146712 0.166885 0.162976 0.163979 0.165674 0.146491 0.159794 0.098542 -0.721531 -0.277777 -0.067984 -0.224630 -0.371721 0.519831 0.127180 0.129136 0.262237 -0.530410 0.122901 -0.444857 0.495889 0.129160 -0.364852 -0.538427 0.237838 -0.532156 -0.528680 0.130715 -1.060327 -0.127647 -0.216570 -0.264232 -0.303207 0.194122 0.120754 0.097533 -1.082435 0.094133 -0.255298 -0.457129 -0.253164 0.356676 0.125575 0.113286 0.463380 0.123975 -0.621217 -0.394597 0.295789 -0.487437 0.123771 -0.476530 0.157285 -0.453994 0.130041 -0.481611 0.052899 0.125073 -0.433694 -0.465987 0.423623 -0.434960 0.123658 -0.717292 0.400518 0.131501 -0.506283 -0.485077 0.096227 -0.012665 -0.026424 0.319125 0.277000 -0.421849 0.147964 0.149498 0.156367 0.147816 0.161742 0.148777 0.163051 0.142532 0.150226 0.151661 0.150062 0.144528 0.152312 0.167033 0.153410 0.158736 0.148968 0.160133 0.142226 0.146977 0.172086 0.145617 0.156047 0.149501 0.163795 0.151069 0.144295 0.155004 0.149962 0.149850 0.141412 0.153142 0.143724 0.156648 0.155401 0.148479 0.152746 0.156661 0.150413 0.152546 0.150468 0.157032 0.150603 0.148507 0.151457 0.146247 0.159665 0.152001 0.153319 0.152287 0.148818 0.161417 0.153611 0.147678 0.186072 0.186412
dipole: -0.4684 -0.4492 -0.3845
dipole: 0.7543
quadrupole: -425.1431 -412.3498 -437.9844
quadrupole: 1.7462 1.8602 -7.8234
quadrupole: 0.0160 12.8093 -12.8253 1.7462 1.8602 -7.8234
hfenergy: -4038.914175 hartree
pointgroup: C01 [X(C61H79B3S4)]
dipole: -0.0653104 -0.2881886 0.027488 debye
InChI: InChI=1/61C.3B.4S.79H
charge 0 multiplicity 1
147 atoms
C  -1.18054725 2.99522067 0.74079005
C  -1.56849421 3.06203866 2.07103643
C  -2.54501076 2.10831878 2.42624196
C  -2.90710333 1.27058612 1.38096332
C  -4.95524662 -0.2692564 2.34157393
C  -5.73896079 -1.40908041 2.34233723
C  -6.651495 -1.49046447 3.423976
C  -6.56948086 -0.39768149 4.24685602
C  1.65422662 4.06864935 -8.61630226
C  0.68728423 3.17707859 -9.0002421
C  -0.15749141 2.81397743 -7.92087712
C  0.16588908 3.41212053 -6.71683155
C  -0.07812232 3.6420483 -3.99646706
C  1.15507081 4.10498553 -3.56184785
C  1.23354271 4.27610439 -2.16370293
C  0.07049455 3.92559116 -1.49383079
H  -1.14337663 3.78704031 2.75723808
H  -2.9529617 2.01801786 3.42634978
H  -5.64606164 -2.16250542 1.56763797
H  -7.33978604 -2.31104338 3.58499916
H  0.58393909 2.80447648 -10.01193639
H  -0.99392917 2.128903 -8.0072378
H  1.98722956 4.28887036 -4.23146097
H  2.11813207 4.61990465 -1.63775522
B  -0.09969249 3.86656525 0.04734209
C  0.91669783 4.65742294 0.95587379
C  2.00628127 3.98566677 1.53856211
C  0.74050287 6.02884938 1.19116152
C  2.89437216 4.69230875 2.34738468
C  1.65066855 6.70895632 2.00354266
C  2.7326312 6.05754158 2.59201232
H  3.73464236 4.16857696 2.79840822
H  1.5179574 7.77361127 2.18603041
C  -0.42807016 6.7700552 0.55659409
C  0.0532963 7.7267561 -0.54123817
H  -1.07375285 6.02460482 0.07220489
C  -1.2942076 7.49319772 1.59471839
C  2.21744157 2.49816935 1.28629781
H  1.47225173 2.17255178 0.54870579
C  3.5936314 2.20494613 0.67656782
C  1.97773739 1.67313846 2.55655345
C  3.70887482 6.81508011 3.47444338
C  3.70507596 6.27789071 4.91200196
C  5.12653392 6.80607606 2.88682642
H  3.370721 7.85856605 3.50925694
C  -1.98007831 2.42242148 -5.47384312
C  -3.12941759 3.10086378 -5.91223936
C  -2.07751684 1.0605102 -5.12814394
C  -4.34132708 2.41566956 -6.03374158
C  -3.30172796 0.41056803 -5.25571417
C  -4.44369481 1.06347828 -5.71912714
H  -5.22084524 2.95783207 -6.36943159
H  -3.37923656 -0.63647526 -4.97862597
C  -3.83970014 -0.8764992 0.0047822
C  -2.97698826 -1.983187 -0.01647205
C  -4.72292996 -0.66995097 -1.06982986
C  -3.05627456 -2.89732888 -1.06916672
C  -4.77080884 -1.59591698 -2.11191295
C  -3.96531845 -2.73648751 -2.11295632
H  -2.40393566 -3.76855211 -1.07323438
H  -5.46836168 -1.43520413 -2.93162008
C  -0.86270087 0.27422284 -4.65404784
H  -0.03339319 0.98006752 -4.51715788
C  -1.10268401 -0.40643662 -3.3003421
C  -0.41896767 -0.73843501 -5.71885787
C  -3.07565453 4.59125145 -6.22015705
C  -3.98155176 5.38970954 -5.27329089
H  -2.04860981 4.93616312 -6.04164017
C  -3.39431548 4.88685514 -7.69007559
C  -5.72871033 0.26678347 -5.88005462
C  -5.67118391 -0.58350229 -7.1585022
H  -5.77579322 -0.42776654 -5.02908817
C  -7.0022771 1.11375519 -5.84826197
C  -1.96454668 -2.19248278 1.1003261
H  -2.11122583 -1.39454706 1.84047813
C  -2.17323998 -3.52275677 1.83334768
C  -0.52969562 -2.05388482 0.57441139
C  -5.62218573 0.55807043 -1.09221861
C  -7.10804929 0.18052777 -1.08175935
H  -5.43172363 1.12930019 -0.17328692
C  -5.28505667 1.4760959 -2.27251949
C  -4.11100945 -3.81209184 -3.17682544
H  -3.33616476 -4.56416928 -2.98116491
C  -5.47489326 -4.50771156 -3.05606279
C  -3.89528937 -3.28988368 -4.60093297
B  -0.59855565 3.18993226 -5.38962423
B  -3.88988523 0.07306786 1.27286716
S  -1.11976159 3.42449848 -2.6361565
S  1.54045752 4.45333536 -6.950744
S  -5.38555746 0.7169244 3.70985779
S  -2.02138551 1.70396947 -0.03250394
H  -3.31153413 5.95954375 -7.89459084
H  -4.41305957 4.57379483 -7.94408861
H  -2.70187664 4.35738281 -8.35175639
H  -3.87305562 6.46476181 -5.45200298
H  -3.72858941 5.18569979 -4.22829554
H  -5.03535204 5.12923573 -5.42111914
H  -1.4050855 0.31988944 -2.54166397
H  -0.19019619 -0.90400596 -2.95443369
H  -1.89199688 -1.16260157 -3.35616591
H  -0.19522374 -0.23862414 -6.66684227
H  -1.20583452 -1.477891 -5.90575981
H  0.4789851 -1.27419431 -5.39287142
H  -7.07887149 1.75567936 -6.73286502
H  -7.03860641 1.7518211 -4.95971708
H  -7.88432375 0.46577059 -5.8394804
H  -5.60896057 0.06166337 -8.04195017
H  -6.56638108 -1.20813699 -7.25191629
H  -4.79404916 -1.23784358 -7.15841352
H  -5.87585801 2.39736103 -2.22801473
H  -5.50405969 0.98189226 -3.22228366
H  -4.22467483 1.74513649 -2.28455441
H  -7.73259246 1.07926489 -1.04399098
H  -7.3472006 -0.44161723 -0.21354812
H  -7.3789184 -0.37712253 -1.98539669
H  -0.38583109 -1.08338139 0.08946259
H  -0.30526508 -2.83406718 -0.16153151
H  0.19240264 -2.14282242 1.39317515
H  -3.19034263 -3.59343534 2.23137098
H  -1.47117048 -3.61540358 2.66859946
H  -2.01144284 -4.37534591 1.1649134
H  -4.65170839 -2.54410847 -4.86965828
H  -3.9692319 -4.1081762 -5.32483875
H  -2.90830482 -2.83017381 -4.70943905
H  -6.28902732 -3.80358059 -3.26157017
H  -5.62409757 -4.90716125 -2.04847281
H  -5.5547491 -5.33351746 -3.77120007
H  4.05835173 5.24127806 4.94499035
H  2.6977466 6.30198662 5.33833098
H  4.36456799 6.87598751 5.5498366
H  5.52996083 5.78808444 2.84947614
H  5.80282636 7.41110165 3.500067
H  5.13291049 7.20632929 1.86858835
H  3.68538534 1.14122067 0.43376181
H  4.401328 2.45914318 1.37141749
H  3.74639656 2.7802686 -0.24177597
H  2.09293266 0.6038141 2.34959276
H  0.96783268 1.84025199 2.94313774
H  2.69205019 1.94599524 3.34142766
H  -1.64418545 6.79950031 2.36539517
H  -2.16940094 7.94366359 1.11528799
H  -0.73752518 8.29538837 2.09091882
H  0.61230269 7.18452744 -1.30999248
H  0.70944399 8.499153 -0.12462833
H  -0.79583877 8.22499145 -1.02090673
H  -7.15291636 -0.19354776 5.13468279
H  2.41922031 4.52099778 -9.23309258
