program: Gaussian 98 g16
title: opt Dimer -> Freq -> Monoanion
version: ES64L-G16RevC.01
basis: 6-31+G(d,p)
method: UwB97XD
operation: FOpt
keyword: #
keyword: UwB97XD/6-31+g(d,p)
keyword: opt
nucrepener: 6551.3059341912
converged: YES YES YES YES
dipole: -0.0001 -3.9916 0.1581
dipole: 3.9947
quadrupole: -383.9307 -339.2916 -328.7580
quadrupole: 0.0000 -0.0006 -0.8938
quadrupole: -33.2706 11.3685 21.9021 0.0000 -0.0006 -0.8938
hfenergy: -2876.9698209 hartree
pointgroup: C01 [X(C42H54B2S3)]
dipole: -0.0000533 -1.5647617 -0.1470246 debye
InChI: InChI=1/42C.2B.3S.54H
charge -1 multiplicity 2
101 atoms
C  1.29218803 0.75995964 0.17550938
C  0.69050773 -0.52167475 0.10153575
C  -0.6904795 -0.52165064 0.10157989
C  -1.29211127 0.76000442 0.17559371
C  -3.48124495 2.41761059 0.27275183
C  -4.85033942 2.62455463 0.28530043
C  -5.24291766 3.98749349 0.36614785
C  -4.16736679 4.83395679 0.4160419
C  4.16761964 4.83379813 0.41595317
C  5.24313222 3.98729159 0.36597278
C  4.85049231 2.6243719 0.28509872
C  3.4813885 2.4174857 0.27261941
H  1.29599993 -1.42168826 0.04945226
H  -1.29600735 -1.42164209 0.04953394
H  -5.54790227 1.79499729 0.23646443
H  -6.27313165 4.32601623 0.38651731
H  6.27336155 4.32577045 0.38629907
H  5.54801724 1.7947856 0.23620718
B  2.77332263 1.02749716 0.19032875
C  3.74799778 -0.23694988 0.11389932
C  4.17703093 -0.74041856 -1.12980944
C  4.17629658 -0.88691854 1.28459739
C  4.99230076 -1.87151254 -1.18523969
C  4.99334866 -2.01840934 1.19922417
C  5.41007981 -2.52876421 -0.02747736
H  5.30473454 -2.25453196 -2.15562791
H  5.31107338 -2.52301825 2.11096792
C  3.73128401 -0.38091993 2.64997181
C  4.91618362 -0.09154491 3.57917478
H  3.20714582 0.56757488 2.4895997
C  2.72857191 -1.34388925 3.29842277
C  3.72866063 -0.07137246 -2.42214927
H  3.21392331 0.85547368 -2.1464601
C  4.90940761 0.31734125 -3.31979177
C  2.71349391 -0.94292969 -3.17257834
C  6.29111702 -3.76389708 -0.09809484
C  5.59375337 -4.91860798 -0.83017212
C  7.65309796 -3.45593065 -0.73521132
H  6.47479118 -4.08950475 0.93448915
C  -3.74796249 -0.23681834 0.11408877
C  -4.17634532 -0.88669694 1.28480879
C  -4.17697638 -0.74033372 -1.12960676
C  -4.99344522 -2.01815375 1.19946716
C  -4.99229303 -1.87139709 -1.18500497
C  -5.41014614 -2.52856446 -0.02722324
H  -5.31123405 -2.52269244 2.1112269
H  -5.30470972 -2.2544526 -2.1553852
C  -3.73133955 -0.38065605 2.65017049
H  -3.20723527 0.56785406 2.48977715
C  -4.91622336 -0.0913101 3.57940116
C  -2.72858564 -1.34358761 3.29861408
C  -3.72858202 -0.07135592 -2.42197456
C  -4.90934752 0.31754309 -3.31951697
H  -3.21367446 0.85540499 -2.1463202
C  -2.71361117 -0.94305329 -3.17250008
C  -6.29124852 -3.76365245 -0.09780264
H  -6.47498893 -4.08918375 0.93479362
C  -7.65318201 -3.45564953 -0.7350023
C  -5.59391554 -4.91844922 -0.82977378
B  -2.77323673 1.02759225 0.19048456
S  2.68293967 3.96502263 0.36415763
S  -2.68272679 3.96511727 0.36420178
S  0.00006123 1.94782753 0.24435096
H  -2.36622651 -0.43835212 -4.08139407
H  -3.15884834 -1.90250395 -3.46392771
H  -1.84274305 -1.14557002 -2.54201535
H  -4.55556476 0.87242312 -4.19582785
H  -5.61708497 0.9513884 -2.77582299
H  -5.45146941 -0.56424763 -3.68176468
H  -1.85527209 -1.47829894 2.65350164
H  -3.18319852 -2.32665368 3.47327657
H  -2.3830279 -0.95204718 4.26235412
H  -5.61270416 0.61143709 3.11102219
H  -4.56538184 0.34934697 4.51949567
H  -5.46990734 -1.00507667 3.82664948
H  -5.40048238 -4.65724095 -1.8762388
H  -6.21588758 -5.82136554 -0.81778522
H  -4.63248538 -5.15243875 -0.36289333
H  -7.53342972 -3.13948864 -1.77736971
H  -8.16113845 -2.64815039 -0.19889609
H  -8.29955028 -4.34130638 -0.72406214
H  5.40038096 -4.65732069 -1.8766287
H  4.63228958 -5.15257507 -0.36334959
H  6.21567527 -5.82155929 -0.81821462
H  7.53341345 -3.13970001 -1.77756534
H  8.29941652 -4.34162405 -0.72429428
H  8.16107337 -2.64849245 -0.19903145
H  4.55562843 0.87229972 -4.19605373
H  5.45135115 -0.56452438 -3.68212166
H  5.61730066 0.95105919 -2.77615066
H  2.36611676 -0.43820135 -4.08146058
H  1.84264428 -1.14529514 -2.54202013
H  3.15856768 -1.90245556 -3.46400747
H  1.8552491 -1.47861778 2.65332547
H  2.38302132 -0.95237054 4.26217436
H  3.18321347 -2.32694463 3.47306731
H  5.61262122 0.61123828 3.11078533
H  5.46991078 -1.00529597 3.82638483
H  4.56535409 0.34908035 4.51928865
H  -4.17327602 5.91395644 0.48007423
H  4.17357785 5.91379492 0.48002835
