program: Gaussian 16
title: MN15/def2svp
version: ES64L-G16RevA.03
frameworkgroup: C1[X(C18H17N2NaO2)]
method: RMN15
basis: def2SVP
operation: Freq
keyword: #N
keyword: Geom=AllCheck
keyword: Guess=TCheck
keyword: SCRF=Check
keyword: GenChk
keyword: RMN15/def2SVP
keyword: Freq
converged: YES YES YES YES
title: Mulliken charges:
elementType: C C C O N C C C C C H C H C H H H C H N H C C H C C H C H H C H H O H C H H H Na
charge: -0.055169 -0.128150 0.103859 -0.513281 -0.285614 0.072423 0.000798 -0.042192 -0.005992 -0.010802 -0.008597 -0.015837 -0.018145 -0.000381 0.007450 0.006962 0.007885 0.324706 0.042758 -0.054949 0.162195 -0.057657 -0.069287 -0.002831 -0.058531 -0.013652 0.012566 -0.004699 0.004607 -0.007019 0.137508 -0.000623 -0.022377 -0.393729 0.154813 -0.030545 0.020060 0.020170 0.016851 0.704450
chargesum: -0.00000
title: Mulliken charges with hydrogens summed into heavy atoms:
elementType: C C C O N C C C C C C C C N C C C C C C O C Na
charge: -0.055169 -0.128150 0.103859 -0.513281 -0.285614 0.072423 0.000798 -0.050790 -0.024137 -0.003352 -0.008875 0.007504 0.367464 0.107247 -0.057657 -0.072118 -0.065550 -0.001087 -0.000092 0.114508 -0.238917 0.026536 0.704450
chargesum: 0.00000
1716.lowfreq: -250.3793 -14.9694 -5.3188 -2.4336 0.0010 0.0010 0.0014 17.2908 33.3994
frequency: -250.3790 16.8462 33.1754 42.5126 45.1105 57.0358 74.0604 84.7862 95.3424 101.0737 119.2220 134.1247 154.1116 162.5558 170.5407 223.0320 234.0427 268.7154 285.8203 298.8333 332.6014 370.8981 402.2056 420.2785 425.7143 438.4522 473.1588 506.1166 531.1500 543.7984 580.2682 594.4693 601.8072 611.0928 629.7458 645.0891 661.0501 682.4888 721.1214 725.0356 750.9143 778.4629 796.5183 797.8506 800.0720 849.4283 867.3310 874.8261 907.2235 923.3439 957.1015 970.7741 986.3600 999.2856 1020.8687 1031.1836 1039.2571 1045.3546 1052.9455 1078.4041 1081.1913 1092.8912 1117.0704 1135.5202 1138.0309 1145.1770 1153.5070 1168.0145 1184.0263 1206.3889 1241.0558 1248.3263 1271.6465 1275.3074 1306.5473 1310.5191 1336.1897 1343.5897 1349.9668 1360.3981 1366.7115 1396.0085 1419.9356 1420.3932 1432.5433 1452.6772 1472.2292 1481.2246 1501.4330 1512.8669 1530.4667 1651.9342 1676.9713 1682.2056 1697.1977 1747.9587 2030.2504 2927.3110 3005.8675 3060.6887 3070.3718 3165.1225 3173.7747 3218.3944 3224.4544 3226.5029 3231.2878 3234.6318 3242.0860 3244.1578 3249.0579 3249.6702 3473.6324 3626.7557
redmass: 12.0938 4.0104 4.4757 4.8586 5.8829 4.7174 3.9899 3.7479 3.5665 4.5508 3.7282 7.5016 6.0985 4.2202 6.5024 6.9528 7.2966 6.1279 1.2087 4.8865 8.0619 6.5227 3.9924 2.8698 2.8771 3.5647 3.6212 4.8452 2.6177 2.0588 5.0369 4.8407 7.1346 6.1161 5.0444 1.1989 3.9641 6.3485 4.6879 1.6064 2.9063 1.7049 2.3146 3.4033 1.1165 3.0486 4.1093 1.3066 1.6674 1.8024 1.4790 3.7783 1.4296 4.3723 1.3754 1.3453 1.7910 1.3656 2.0414 1.8992 2.0196 1.6767 1.9673 1.1160 1.0606 1.5342 2.2920 1.0989 3.2175 1.5837 2.3718 2.2004 1.7125 1.1472 1.7601 2.0505 1.1527 2.3155 2.5481 1.2831 6.4616 5.0278 1.0489 3.0160 1.0564 1.4141 2.6653 1.1337 3.5113 3.5059 3.0542 6.7022 7.3229 6.8706 7.9760 10.8591 12.5316 1.0793 1.0643 1.1000 1.0378 1.1051 1.1045 1.0885 1.0881 1.0886 1.0913 1.0938 1.0956 1.0964 1.1000 1.0994 1.0704 1.0802
irintensity: 408.5736 0.2444 7.7277 7.7163 20.7892 5.3134 0.0877 7.5202 4.9642 5.5405 5.5210 11.9050 12.1002 10.2856 9.1711 17.5823 25.9682 54.4395 4.3477 30.3532 25.1844 13.0276 21.1188 2.8609 13.6817 1.0747 11.0247 85.9817 77.6394 68.7169 6.0857 8.2396 43.9401 9.0917 3.3776 168.0902 59.9971 40.4864 5.1537 35.2015 30.4544 67.8605 55.1713 26.1237 0.7674 7.4373 18.3577 2.8894 3.7310 7.0496 6.0759 3.8468 5.6749 0.6963 1.5023 0.0671 16.8831 0.1930 9.1381 12.7499 30.2510 19.3221 12.9207 6.0319 0.1422 13.7444 28.3135 0.8571 101.2713 0.4654 395.7630 57.5943 60.5222 32.2003 36.3502 29.5788 125.1458 283.1714 47.8046 14.2751 10.9596 174.3955 13.1102 53.1458 7.2130 40.1945 20.5209 16.5948 299.6512 39.7828 53.5934 6.7232 8.3414 68.9469 500.1903 1212.8569 943.1815 83.8952 103.9970 72.3507 28.8373 50.0669 38.4524 7.2514 3.6075 0.3074 7.4834 18.3990 19.9415 19.0008 15.5101 10.5069 1643.9451 140.7371
temp: 298.150 k
press: 1.00000 atm
elementType: 6 6 6 8 7 6 6 6 6 6 1 6 1 6 1 1 1 6 1 7 1 6 6 1 6 6 1 6 1 1 6 1 1 8 1 6 1 1 1 11
symmnumber: 1
zpe: 822953.8 jmol-1
zpe.correction: 0.313447 hartree
zpe.thermalcorrener: 0.334764 hartree
zpe.thermalcorrenthalpy: 0.335708 hartree
zpe.thermalcorrgfe: 0.260578 hartree
zpe.sumelectzpe: -1116.031873 hartree
zpe.sumelectthermal: -1116.010556 hartree
zpe.sumelectthermalent: -1116.009611 hartree
zpe.sumelectthermalfe: -1116.084741 hartree
dipole: -7.6765 2.7416 0.4687
dipole: 8.1649
quadrupole: -150.5099 -83.5715 -133.0092
quadrupole: -15.5530 3.6878 -9.6851
quadrupole: -28.1464 38.7920 -10.6457 -15.5530 3.6878 -9.6851
hfenergy: -1116.3453191 hartree
pointgroup: C01 [X(C18H17N2Na1O2)]
dipole: -3.0200234 1.0728652 0.2174761 debye
polarizability: 445.3227983|-14.2895393|328.2935313|-45.7320317|-26.3624667|206.6199536 unknown
InChI: InChI=1/18C.2N.Na.2O.17H
charge 0 multiplicity 1
40 atoms
C  0.4931803 1.32014116 -0.3620893
C  -0.96065834 -0.35663495 0.38938252
C  -3.0935014 -1.06885159 0.38629781
O  -1.19785489 1.89398184 -0.12488455
N  1.29855568 2.14524412 -0.70606549
C  0.29009932 -0.10482493 -0.06461126
C  1.35214653 -1.08061745 -0.36313991
C  1.48249706 -2.24799146 0.41214198
C  2.26146267 -0.87270822 -1.41612619
C  2.49223308 -3.17438058 0.1466147
H  0.80330983 -2.41485885 1.25328105
C  3.27299476 -1.79672654 -1.6757931
H  2.17545831 0.02847461 -2.0264651
C  3.39632825 -2.9503369 -0.89539017
H  2.58027642 -4.07012224 0.76645383
H  3.97226916 -1.61469246 -2.49573442
H  4.19237517 -3.67064643 -1.09820386
C  -1.79757212 0.88453679 0.58261733
H  -1.79899105 1.10319048 1.6783953
N  -1.74952755 -1.4596466 0.557064
H  -1.4321842 -2.41121356 0.38046372
C  -3.18005492 0.33451197 0.28616335
C  -4.4091123 0.94450767 0.08383994
H  -4.48300998 2.03304707 0.01324843
C  -4.22168601 -1.8771338 0.29149265
C  -5.45583379 -1.24826563 0.07281083
H  -6.35541341 -1.86206678 -0.01830559
C  -5.55455864 0.14131359 -0.03695511
H  -6.52802148 0.60439302 -0.21330816
H  -4.14568599 -2.96388759 0.3683058
C  3.88423775 0.83170443 1.09534627
H  2.91121019 1.04287538 1.57975019
H  3.91859574 -0.2673739 0.94224887
O  3.98602419 1.51449945 -0.13193519
H  3.073395 1.71893268 -0.44557088
C  5.01626815 1.24499267 2.01337537
H  4.97631681 0.69589573 2.96627036
H  5.98841706 1.03703278 1.53944069
H  4.96723752 2.32353286 2.22946267
Na -0.37039587 3.81534719 -0.75542537
