program: Gaussian 09
title: 000052759
version: EM64L-G09RevD.01
frameworkgroup: C1[X(C15H18N2O)]
method: RPBEPBE
basis: SDD
operation: Freq
keyword: #p
keyword: freq=noraman
keyword: PBEPBE/SDD
title: #p freq=noraman PBEPBE/SDD
converged: YES YES NO NO
title: Mulliken charges:
elementType: O N N C C C C C C C C C C C C C C C H H H H H H H H H H H H H H H H H H
charge: -0.153512 -0.085581 -0.096045 0.083983 0.149070 0.138623 0.403167 0.395883 -0.702381 -0.010041 -0.510002 -0.814346 -0.827637 -0.821224 -0.826999 -0.162408 -0.191048 -0.319869 0.238473 0.262530 0.277096 0.254624 0.224595 0.239173 0.243040 0.239652 0.232585 0.225043 0.233912 0.230289 0.224967 0.231282 0.235520 0.254514 0.252612 0.250461
chargesum: 0.00000
title: Mulliken charges with hydrogens summed into heavy atoms:
elementType: O N N C C C C C C C C C C C C C C C
charge: -0.153512 -0.085581 -0.096045 0.083983 0.149070 0.138623 0.403167 0.395883 -0.463909 -0.010041 0.029624 -0.095954 -0.112361 -0.131979 -0.135230 0.092106 0.061564 -0.069408
polarizability: 2.24744101e+02 4.94024140e-01 1.92553306e+02 -1.55853558e+01 4.32640606e+00 1.06757568e+02
1716.lowfreq: -0.0003 -0.0003 0.0004 2.0185 6.5168 9.1506 18.9302 26.9280 47.1798
frequency: 18.1557 26.5689 47.0905 55.4090 96.5302 104.4943 112.5894 121.7763 135.0265 155.9926 166.4727 180.7718 205.2332 260.5012 285.8025 296.4259 320.2069 331.7837 340.1268 346.3577 387.4762 431.4299 481.7936 499.4638 570.5089 585.8455 588.1812 615.1887 650.8828 658.9540 678.1574 718.2918 754.5387 768.6389 794.0474 819.6640 840.5031 846.4175 878.5065 885.8720 940.1600 967.7978 993.8655 1011.5728 1013.6798 1020.9648 1025.2253 1040.5067 1051.4984 1052.6603 1055.7996 1088.1163 1102.2011 1107.8289 1160.7400 1223.3792 1230.4591 1246.5405 1269.3989 1302.7140 1319.3728 1343.7240 1354.1999 1358.2936 1391.9668 1395.7883 1397.5623 1408.0002 1411.6479 1426.1147 1451.4049 1456.0785 1461.0293 1463.0099 1472.8373 1475.3472 1479.3997 1480.0820 1481.5813 1487.4369 1492.4317 1579.3780 1609.7306 1630.9680 2968.2078 2970.2361 2970.6904 2975.9796 2995.3679 3041.5461 3042.1469 3046.4014 3047.9669 3050.0159 3082.0773 3084.3524 3085.4483 3102.5416 3117.0871 3222.5058 3227.1313 3250.9658
redmass: 5.3740 3.9108 4.6319 3.8738 4.9326 1.6471 1.3090 1.3567 1.6725 2.7519 1.1384 1.7778 2.3317 3.6179 6.5157 2.6673 2.4515 2.3517 2.9343 2.7588 4.4285 4.5494 3.1708 4.6693 4.1348 3.1670 2.8942 3.2148 3.3818 3.9167 4.3350 1.2851 3.1587 1.5925 4.6532 3.0676 1.6210 3.3813 6.2910 1.3088 2.3637 2.1691 1.3332 3.0616 1.5985 1.4141 1.4635 2.4162 1.6108 1.6734 1.6923 2.5287 2.8266 1.8341 1.4162 1.5460 5.7908 1.3998 1.8762 2.0643 2.8792 4.5358 6.1560 3.6545 3.0752 1.2419 1.3183 1.2118 1.2040 1.3388 1.9383 1.9681 1.1968 1.0622 1.3447 1.1015 1.1253 1.4984 2.0913 1.1132 1.0785 6.2532 6.2934 10.0431 1.0400 1.0383 1.0384 1.0403 1.0608 1.0968 1.0963 1.0966 1.0945 1.0994 1.0984 1.0982 1.0977 1.0961 1.0912 1.0910 1.0972 1.1101
irintensity: 0.3530 1.6754 1.9492 5.2382 0.7962 0.0858 0.1321 0.7457 3.2682 0.1992 0.1308 0.5581 1.3377 2.8117 2.5872 0.0639 0.4335 1.0716 0.4353 0.8780 6.8781 0.1420 1.2677 4.0534 4.1818 0.4210 0.3465 5.2759 11.2390 13.6371 21.3198 29.8945 16.4561 47.9204 2.4965 0.0346 5.4912 1.7515 10.0785 8.7902 4.2255 33.0839 3.2332 38.3270 17.3765 1.1049 15.7332 1.9737 0.9259 4.1772 22.8794 1.7711 32.9300 15.3135 2.4635 29.4257 12.6403 0.0586 37.0613 13.7679 33.6179 3.6120 1.2998 2.3660 27.1110 1.4695 4.6250 18.7817 19.5535 39.1494 8.7242 33.9650 12.0989 5.8138 8.3886 17.6683 8.3946 7.2147 55.0358 21.9628 5.8805 1.3267 4.3343 91.3221 55.9503 33.4622 18.2908 19.7657 32.1033 20.2157 46.8541 0.9443 3.2356 5.6316 33.6297 21.8895 8.6269 15.0210 25.0860 2.2621 2.7063 4.2049
temp: 298.150 k
press: 1.00000 atm
elementType: 8 7 7 6 6 6 6 6 6 6 6 6 6 6 6 6 6 6 1 1 1 1 1 1 1 1 1 1 1 1 1 1 1 1 1 1
symmnumber: 1
zpe: 772039.0 jmol-1
zpe.correction: 0.294054 hartree
zpe.thermalcorrener: 0.312623 hartree
zpe.thermalcorrenthalpy: 0.313567 hartree
zpe.thermalcorrgfe: 0.245574 hartree
zpe.sumelectzpe: -765.793915 hartree
zpe.sumelectthermal: -765.775346 hartree
zpe.sumelectthermalent: -765.774402 hartree
zpe.sumelectthermalfe: -765.842395 hartree
dipole: 6.3857 1.9300 -2.6060
dipole: 7.1619
quadrupole: -128.3506 -94.0607 -113.9063
quadrupole: -9.7576 0.0502 3.2116
quadrupole: -16.2447 18.0452 -1.8004 -9.7576 0.0502 3.2116
hfenergy: -766.0879695 hartree
pointgroup: C01 [X(C15H18N2O1)]
dipole: -2.473765 -0.8835258 -1.019511 debye
polarizability: 224.7257156|2.0709784|192.716479|15.3498151|-3.1788581|106.6127802 unknown
InChI: InChI=1S/C15H18N2O/c1-10-7-11(2)13(4)15(12(10)3)14(18)8-17-6-5-16-9-17/h5-7,9H,8H2,1-4H3
charge 0 multiplicity 1
36 atoms
O  1.053717 0.546346 1.592343
N  2.877737 0.132871 -0.543699
N  4.96102 1.012358 -0.343689
C  -0.918964 0.030989 0.238816
C  -1.752705 1.182059 0.13086
C  -1.431068 -1.291842 0.100685
C  -3.137506 0.994943 -0.151627
C  -2.817102 -1.464612 -0.176323
C  -3.636172 -0.318925 -0.303853
C  0.562735 0.223262 0.484417
C  1.442408 0.054536 -0.781697
C  -1.20442 2.591279 0.293322
C  -0.539217 -2.513032 0.278119
C  -4.07263 2.183128 -0.284224
C  -3.419411 -2.851021 -0.321094
C  3.695305 -0.884457 -0.029412
C  3.688081 1.258489 -0.704077
C  4.97073 -0.328212 0.080574
H  -4.703154 -0.455977 -0.519555
H  1.143441 0.855283 -1.486662
H  1.178956 -0.898432 -1.276548
H  -0.133353 2.607249 0.548164
H  -1.351731 3.188007 -0.627831
H  -1.733225 3.12736 1.103885
H  0.442523 -2.260347 0.712877
H  -1.00848 -3.245746 0.959761
H  -0.368684 -3.040656 -0.681496
H  -3.753362 2.869712 -1.091797
H  -5.101738 1.855606 -0.508546
H  -4.10529 2.782796 0.645775
H  -2.899801 -3.448057 -1.094458
H  -3.352113 -3.425922 0.623081
H  -4.484942 -2.79264 -0.600125
H  3.309656 -1.872636 0.20834
H  3.307941 2.205256 -1.082242
H  5.884715 -0.798915 0.434738
