program: Gaussian 16
title: (SMD = EtOH)-MN15/def2-SVP
version: ES64L-G16RevC.01
method: RMN15
basis: def2SVP
operation: Freq
keyword: #N
keyword: Geom=AllCheck
keyword: Guess=TCheck
keyword: SCRF=Check
keyword: GenChk
keyword: RMN15/def2SVP
keyword: Freq
converged: YES YES YES YES
title: Mulliken charges:
elementType: C C C O N C C C C C H C H C H H H C H N H C C H C C H C H H H O H C H H C H H H
charge: -0.019662 -0.069643 0.107210 -0.289095 -0.133429 0.067534 0.016064 -0.032396 -0.028766 -0.005347 -0.001936 -0.008494 -0.009011 0.002688 0.012291 0.012174 0.012698 0.253803 0.093427 -0.057039 0.172957 -0.039137 -0.046892 0.007205 -0.050110 -0.006126 0.018856 -0.001222 0.011711 -0.000264 0.129397 -0.404622 0.157505 0.132387 -0.010107 0.008537 -0.045401 0.005448 0.019153 0.017656
chargesum: -0.00000
title: Mulliken charges with hydrogens summed into heavy atoms:
elementType: C C C O N C C C C C C C C N C C C C C O C C
charge: -0.019662 -0.069643 0.107210 -0.289095 -0.004032 0.067534 0.016064 -0.034332 -0.037777 0.006944 0.003681 0.015385 0.347230 0.115918 -0.039137 -0.039688 -0.050375 0.012730 0.010489 -0.247117 0.130816 -0.003145
chargesum: 0.00000
1716.lowfreq: -0.0007 -0.0005 0.0006 2.1912 8.9654 11.4698 14.7760 30.0726 41.4571
frequency: 13.7488 29.7899 41.3537 44.7064 54.3572 78.2737 85.8010 103.3088 123.7964 154.9542 169.8602 189.8449 207.9346 250.2461 287.7816 298.3784 311.7054 381.4120 403.5948 417.1487 421.1680 438.1904 464.4540 489.3391 537.2347 545.2150 576.1253 607.7283 613.9389 633.8657 651.2197 682.7932 721.8567 724.7251 726.4603 751.6091 770.0337 781.7003 790.4262 797.3058 816.3275 824.5088 852.5673 874.2044 880.9120 908.9958 913.3633 964.0272 970.5065 990.6761 999.7944 1007.4585 1027.5771 1036.7822 1040.9273 1051.2218 1055.0360 1085.1952 1092.9842 1094.9309 1113.2401 1120.9949 1137.1313 1138.5943 1143.6653 1168.8815 1188.2991 1202.3562 1228.3106 1242.3656 1268.3194 1277.0035 1281.6680 1310.6954 1332.1625 1347.7134 1352.8438 1367.0848 1372.1256 1400.0365 1415.1387 1416.6075 1426.8096 1436.3701 1446.6196 1470.0773 1473.5371 1504.0985 1517.8487 1537.5144 1654.5093 1676.4517 1685.4246 1700.9267 1732.8769 1768.2300 3030.4580 3055.9061 3065.3053 3104.5128 3161.2075 3168.1544 3218.0374 3227.4276 3232.6200 3234.5576 3240.4870 3241.5387 3249.3495 3250.3473 3254.7241 3462.4954 3582.9913 3618.6013
redmass: 4.3893 4.4340 3.6650 4.9225 4.2051 3.9123 3.8756 2.8831 3.5650 4.9821 3.4309 5.3826 4.8571 5.7207 1.3868 4.8314 4.1471 5.6904 3.6223 2.5974 2.8946 3.1880 4.4810 4.0132 2.0693 2.2877 4.5990 4.5558 5.2788 4.2435 5.9453 3.4705 2.3400 3.5538 2.6678 2.2430 1.5720 1.6400 1.1779 1.6308 1.5606 3.1414 3.1384 4.6364 1.2389 1.6757 1.8301 1.5059 4.4131 1.4521 3.9525 2.1239 1.3796 1.3664 1.7695 1.3628 2.0065 1.8916 1.5964 1.8063 1.8073 1.5342 1.2576 1.0604 1.7281 1.0927 3.5402 1.7627 2.5973 1.8941 1.4474 1.6658 1.7562 1.4402 2.1551 2.9849 1.2794 6.3462 2.7854 1.3563 1.0644 3.0154 5.0112 1.0857 1.1668 1.1234 2.6982 3.5752 3.5230 3.3692 6.7108 7.3208 6.9142 8.1718 10.4952 11.2176 1.0677 1.0832 1.0376 1.0979 1.1047 1.1047 1.0901 1.0881 1.0876 1.0923 1.0923 1.0968 1.0965 1.1010 1.1002 1.0693 1.0757 1.0807
irintensity: 0.3274 0.3984 3.9032 0.9551 0.3058 0.4598 1.5027 4.4559 2.5590 2.7695 3.2680 6.4424 2.0171 4.3140 2.5359 1.9975 5.1652 10.5262 9.4835 6.5326 0.1458 1.8874 24.0835 10.1632 112.3773 45.5993 11.6439 24.4009 8.4435 20.3670 16.1632 27.8639 8.2782 88.8567 38.2147 58.4283 22.5342 88.9449 30.5691 58.9463 88.9335 32.2677 0.9680 26.1055 2.0494 4.1384 3.2648 2.7430 93.6071 3.4906 39.8930 29.7697 0.1222 0.2816 10.5545 1.5228 7.9659 9.3226 63.2127 10.8830 12.2703 34.2315 34.2615 0.4426 51.6520 0.4972 131.8170 27.4535 432.5076 11.5835 42.7111 5.7189 32.8937 3.5560 171.4936 56.0170 3.4098 3.8329 153.4857 50.2473 36.5805 40.2634 426.0506 4.4436 82.6592 6.6120 10.5698 283.8240 12.1407 74.9408 13.6738 9.4943 41.9117 768.5275 1447.8447 168.7627 99.9492 11.9151 20.6513 90.7275 65.6239 42.4556 6.0439 1.3196 2.0229 3.7346 5.0479 22.3882 11.8917 16.0544 8.4006 1383.1431 102.3060 170.3780
temp: 298.150 k
press: 1.00000 atm
elementType: 6 6 6 8 7 6 6 6 6 6 1 6 1 6 1 1 1 6 1 7 1 6 6 1 6 6 1 6 1 1 1 8 1 6 1 1 6 1 1 1
symmnumber: 1
zpe: 862008.9 jmol-1
zpe.correction: 0.328322 hartree
zpe.thermalcorrener: 0.347747 hartree
zpe.thermalcorrenthalpy: 0.348692 hartree
zpe.thermalcorrgfe: 0.277416 hartree
zpe.sumelectzpe: -954.445378 hartree
zpe.sumelectthermal: -954.425953 hartree
zpe.sumelectthermalent: -954.425008 hartree
zpe.sumelectthermalfe: -954.496284 hartree
dipole: -2.1305 -10.3155 2.2452
dipole: 10.7698
quadrupole: -107.6042 -145.6933 -127.4487
quadrupole: -0.1239 -4.0122 4.1119
quadrupole: 19.3112 -18.7779 -0.5333 -0.1239 -4.0122 4.1119
hfenergy: -954.7737001 hartree
pointgroup: C01 [X(C18H18N2O2)]
dipole: -0.8382092 -4.0584186 0.883311 debye
polarizability: 407.7136631|-19.2032361|315.3640793|-45.020326|-35.5589265|210.7397632 unknown
InChI: InChI=1/18C.2N.2O.18H
charge 0 multiplicity 1
40 atoms
C  0.26890942 1.21389907 -0.22860381
C  -0.94184073 -0.49404419 0.59248859
C  -3.08776888 -1.11262351 0.48895843
O  -0.9887453 1.71739838 -0.01855451
N  1.16229756 2.00530196 -0.67807713
C  0.29670464 -0.2244693 0.1029911
C  1.36850726 -1.17548814 -0.22033387
C  1.55446953 -2.31239074 0.58803612
C  2.19506188 -1.01225578 -1.34747619
C  2.53614891 -3.25452092 0.28101051
H  0.93034787 -2.44594934 1.47655326
C  3.1816898 -1.95243612 -1.64668679
H  2.04773254 -0.1597346 -2.0146395
C  3.3580453 -3.07581792 -0.83504362
H  2.66549102 -4.12915061 0.92301899
H  3.81095698 -1.80958934 -2.5284155
H  4.13145227 -3.81000682 -1.07202675
C  -1.73359662 0.7676307 0.71531078
H  -1.76303895 1.10178669 1.77103334
N  -1.77334413 -1.55939674 0.75996817
H  -1.48125824 -2.52372121 0.60610357
C  -3.10940492 0.29011319 0.33324615
C  -4.29596067 0.94879105 0.04390045
H  -4.3166524 2.03584409 -0.06206656
C  -4.24305156 -1.87392415 0.3513206
C  -5.43064538 -1.19991806 0.03700712
H  -6.34973522 -1.77719696 -0.08918104
C  -5.46276594 0.18872236 -0.12178296
H  -6.40297501 0.68504582 -0.37106624
H  -4.22056083 -2.95889728 0.47040106
H  2.07134217 1.54479836 -0.76156991
O  -0.04939557 4.34624166 -1.62212603
H  0.49349114 3.61812714 -1.23396324
C  -0.71092374 3.80468541 -2.73921845
H  -1.2934582 2.90361113 -2.4603125
H  -1.44630988 4.55097841 -3.08521702
C  0.24221503 3.46370842 -3.87150326
H  0.95981619 2.6909406 -3.5516906
H  -0.29889203 3.0827048 -4.751583
H  0.81419239 4.35470545 -4.17440351
