program: Gaussian 16
title: MN15/def2svp
version: ES64L-G16RevA.03
method: RMN15
basis: def2SVP
operation: Freq
keyword: #N
keyword: Geom=AllCheck
keyword: Guess=TCheck
keyword: SCRF=Check
keyword: GenChk
keyword: RMN15/def2SVP
keyword: Freq
converged: YES YES YES YES
title: Mulliken charges:
elementType: C C C C C H H H H C C C O C C C C C H C H C H H H N C N H C H H H C H H O H
charge: -0.031657 -0.040040 -0.016132 0.000122 0.015903 0.003214 0.014517 0.017540 0.030586 0.123282 0.060568 0.173274 -0.201618 -0.075685 0.037078 -0.025971 -0.004605 -0.007118 0.011244 -0.001344 0.008158 0.012040 0.017670 0.017693 0.018904 0.044202 -0.222625 -0.080990 0.173807 -0.045448 0.021110 0.021333 0.026387 0.128111 -0.007063 -0.006634 -0.387611 0.177794
chargesum: -0.00000
title: Mulliken charges with hydrogens summed into heavy atoms:
elementType: C C C C C C C C O C C C C C C C N C N C C O
charge: -0.028443 -0.040040 -0.001615 0.017662 0.046489 0.123282 0.060568 0.173274 -0.201618 -0.075685 0.037078 -0.014726 0.003554 0.010552 0.016349 0.030944 0.044202 -0.222625 0.092817 0.023382 0.114414 -0.209817
1716.lowfreq: -4.4008 -0.0010 -0.0006 -0.0004 4.5381 7.7464 15.6033 29.3648 43.8864
frequency: 12.6077 29.2503 43.7704 43.9185 61.7687 64.8314 72.6283 77.9555 87.8462 123.0660 141.3239 156.6633 166.7116 212.2348 252.5365 271.4114 280.0726 293.9553 333.2244 398.5475 414.0911 418.6891 423.3500 466.9281 481.8038 495.5883 504.4181 512.9596 550.6153 569.5409 588.4437 611.4499 629.5876 657.2217 677.0625 723.0412 739.8172 756.0328 786.8408 795.0060 808.7176 815.2512 844.8004 875.3441 878.7949 913.2866 925.8761 971.2731 985.7434 1006.4080 1009.9873 1028.2166 1035.3816 1048.4071 1053.4323 1057.3331 1057.8254 1095.4880 1103.4141 1123.8771 1138.4902 1142.5420 1164.1615 1172.2240 1184.1983 1211.7271 1240.5617 1266.2686 1273.3970 1281.7247 1308.7674 1313.8064 1357.3465 1359.5322 1371.1877 1375.3835 1411.4609 1421.4826 1435.1096 1455.5695 1474.7187 1486.4212 1501.0795 1526.0966 1528.3744 1656.0770 1679.2830 1681.2128 1688.9276 1714.1221 1807.5737 2370.5315 3023.8211 3063.4686 3073.7911 3167.2588 3180.9452 3228.2768 3231.9568 3236.9606 3238.9885 3243.4575 3246.1993 3254.3105 3255.5384 3259.8558 3634.4275 3766.6477
redmass: 5.6877 4.7535 4.1885 4.3529 5.7475 4.9268 4.8734 4.6723 1.6926 5.0056 5.6549 7.8491 7.5511 6.1374 6.2335 5.8166 1.1454 7.2948 7.3150 5.9786 2.7390 2.6908 3.5036 7.1337 1.5115 1.9040 1.3092 3.3654 6.7971 4.2029 6.9453 6.3440 6.6845 5.5630 6.3430 1.6649 7.8425 2.3522 1.6657 2.5436 1.0753 4.1333 4.1413 2.4252 1.7349 1.5870 1.7829 1.4291 7.0074 5.2912 1.4066 1.3770 1.7541 1.3804 1.5795 1.7583 1.6981 1.6359 1.4214 2.1406 1.1968 1.0650 1.6004 1.0953 2.5597 2.4882 1.9739 2.8024 1.3519 1.0882 2.4672 1.5296 4.0788 1.2756 7.4590 4.0466 3.0679 1.0386 1.0673 1.4767 2.6632 1.1593 3.4164 3.1019 3.3521 6.6734 7.6809 6.9245 7.9110 10.2257 12.8040 12.6793 1.0584 1.1066 1.0378 1.1052 1.1045 1.0883 1.0897 1.0885 1.0928 1.0925 1.0971 1.1012 1.0964 1.0999 1.0813 1.0663
irintensity: 2.3196 0.3014 2.4404 0.2480 0.7994 0.0874 0.8399 0.8161 2.4344 2.6596 1.8325 3.1175 6.9465 5.4370 3.0259 0.3616 2.3756 14.7409 17.4260 6.4694 10.5771 11.6232 7.4032 18.9031 92.4840 11.7033 194.9690 37.6219 25.6578 0.7795 4.9440 1.5404 16.4593 11.1877 1.6507 43.6629 29.7185 41.2312 49.2986 35.6417 0.0788 9.4061 1.4499 19.3966 20.7050 5.7772 7.1783 3.3063 20.7441 88.4254 0.9115 0.7224 2.3805 0.7280 9.9298 24.3270 23.8926 17.1653 65.6126 123.4694 15.4908 0.1415 11.5099 1.9095 63.3063 58.0800 495.7948 3.2035 196.8622 3.0538 156.8040 18.4473 397.8824 0.7045 43.2092 520.6183 238.2889 10.4573 15.5083 24.7628 16.3938 32.8693 125.0654 194.1488 265.2700 8.7439 33.2000 108.8658 1067.8751 158.6646 737.0614 196.5554 102.8268 98.8157 24.3078 50.6358 32.7740 1.7346 0.2378 3.6178 1.7453 1.7409 14.0784 16.5802 7.7497 7.3267 182.6208 707.7060
temp: 298.150 k
press: 1.00000 atm
elementType: 6 6 6 6 6 1 1 1 1 6 6 6 8 6 6 6 6 6 1 6 1 6 1 1 1 7 6 7 1 6 1 1 1 6 1 1 8 1
symmnumber: 1
zpe: 793548.4 jmol-1
zpe.correction: 0.302247 hartree
zpe.thermalcorrener: 0.322845 hartree
zpe.thermalcorrenthalpy: 0.323789 hartree
zpe.thermalcorrgfe: 0.249342 hartree
zpe.sumelectzpe: -953.266237 hartree
zpe.sumelectthermal: -953.245639 hartree
zpe.sumelectthermalent: -953.244694 hartree
zpe.sumelectthermalfe: -953.319142 hartree
dipole: -7.2025 0.7787 11.4781
dipole: 13.5731
quadrupole: -154.9717 -110.8009 -130.8604
quadrupole: 6.1394 20.9277 -11.2373
quadrupole: -22.7607 21.4101 1.3506 6.1394 20.9277 -11.2373
hfenergy: -953.5684838 hartree
pointgroup: C01[X(C18H16N2O2)]
dipole: -2.8336725 0.3063534 4.5158226 debye
polarizability: 195.5310692|-43.540224|485.0386156|-69.6690233|-13.3879699|320.5730469 unknown
InChI: InChI=1/18C.2N.2O.16H
charge 0 multiplicity 1
38 atoms
C  -0.39331789 1.55843308 2.09953519
C  0.98940971 1.07866317 0.1521677
C  0.93781907 2.40819761 -0.2754041
C  0.21421214 3.31600853 0.49388359
C  -0.43953396 2.88472406 1.66241592
H  -0.90571333 1.24012891 3.00890647
H  1.45352498 2.71326484 -1.1890725
H  0.15004043 4.36359143 0.19445406
H  -1.00396225 3.61144552 2.25196604
C  0.33709733 0.65835778 1.32500757
C  1.30917034 -1.2329502 0.5194725
C  1.64112784 -0.09358113 -0.42490282
O  2.3184754 -0.19186998 -1.43653409
C  1.69675158 -2.53145324 0.34522999
C  1.40938935 -3.6391677 1.2909006
C  1.46148393 -3.44095722 2.68196025
C  1.10938551 -4.92119743 0.79845764
C  1.19269138 -4.49502019 3.55543895
H  1.74540108 -2.46651902 3.08673135
C  0.83718832 -5.97016656 1.67495478
H  1.08233659 -5.09286127 -0.28086934
C  0.87376806 -5.76001082 3.05617509
H  1.24392641 -4.32703053 4.63355929
H  0.59624039 -6.95817765 1.27625006
H  0.66281366 -6.58340972 3.74225781
N  2.97263678 -3.3164553 -1.77233284
C  2.4052306 -2.90082351 -0.84589093
N  0.55216163 -0.70029142 1.53036752
H  0.10046987 -1.23790875 2.26679712
C  4.38237456 -0.88329339 -5.50984643
H  3.72642364 -0.47849423 -6.29609562
H  5.32604681 -0.31629255 -5.52808665
H  4.60444053 -1.93329125 -5.75029269
C  3.72049301 -0.76519266 -4.15553474
H  2.78804727 -1.36302841 -4.14129326
H  4.37730269 -1.20292997 -3.37855907
O  3.45769562 0.59486539 -3.89301082
H  3.02543645 0.63907449 -3.02213442
