program: Gaussian 09
title: 000052754
version: EM64L-G09RevD.01
frameworkgroup: C1[X(C9H13ClN2)]
method: RPBEPBE
basis: SDD
operation: Freq
keyword: #p
keyword: freq=noraman
keyword: PBEPBE/SDD
title: #p freq=noraman PBEPBE/SDD
converged: YES YES NO NO
title: Mulliken charges:
elementType: Cl N N C C C C C C C C C H H H H H H H H H H H H H
charge: -0.084931 -0.117975 -0.444204 -0.349349 0.472425 -0.607851 -0.606829 -0.342813 -0.405002 -0.210596 -0.191033 -0.121578 0.230925 0.231043 0.294023 0.189265 0.230841 0.229729 0.230717 0.191207 0.228308 0.241846 0.217766 0.246441 0.247626
chargesum: 0.00000
title: Mulliken charges with hydrogens summed into heavy atoms:
elementType: Cl N N C C C C C C C C C
charge: -0.084931 -0.117975 -0.150182 0.112619 0.472425 0.041984 0.043403 -0.100967 -0.187236 0.035845 0.056594 -0.121578
polarizability: 1.92228751e+02 3.23048444e+00 1.08643885e+02 -5.07387262e-01 3.10199441e-01 6.97695793e+01
1716.lowfreq: -0.0024 -0.0022 -0.0019 2.3833 10.0741 12.7111 22.2280 49.9712 89.8990
frequency: 16.9884 49.8552 89.8959 96.4613 153.7928 162.1322 206.8678 211.5246 254.1372 292.9829 307.3476 309.0127 376.4679 410.0280 426.3376 444.0377 469.0695 496.1287 625.9452 653.8240 690.8548 794.7096 801.7778 807.2014 849.5478 922.2263 937.1791 983.4165 1008.1099 1022.2265 1047.9736 1064.6822 1074.4935 1094.0254 1116.7958 1138.2123 1185.8692 1191.6948 1265.1374 1299.2687 1313.3020 1322.3313 1354.4337 1373.9948 1410.4266 1424.4433 1440.1295 1454.6469 1459.0224 1471.8815 1478.4970 1483.1538 1497.1022 1503.1837 1580.9510 1619.4914 2871.1229 2882.3461 2935.4442 2985.2252 3015.7819 3016.7407 3078.7411 3082.4627 3120.7485 3150.3931 3165.7552 3171.8474 3576.7264
redmass: 3.5722 3.2124 4.0565 3.9938 3.2836 4.5939 1.1143 1.0747 6.3797 1.2358 6.2783 3.2776 3.1465 2.7877 2.0146 4.0208 4.2454 2.5897 7.1197 6.9757 3.0412 1.2577 4.6348 1.8038 4.0075 1.3276 1.3474 4.1675 1.6559 5.4826 1.5162 2.0076 2.5471 1.2527 1.3399 1.4055 1.1158 1.5766 1.6360 1.4132 2.9027 1.7087 3.3685 1.3511 4.2060 1.1260 1.1264 1.4771 1.0569 1.1294 1.2814 1.0519 1.6964 1.3138 5.7998 6.4508 1.0557 1.0562 1.0577 1.1059 1.0740 1.0752 1.1003 1.1003 1.0893 1.0875 1.0952 1.0967 1.0767
irintensity: 1.4251 2.3054 0.5512 3.0933 4.0528 10.2002 3.0829 3.2680 0.2883 70.9466 3.4665 16.3650 6.6757 0.4198 0.4789 15.6396 10.8972 25.0776 0.7851 33.2099 1.1927 0.1057 20.2102 90.4394 0.9809 0.0916 0.0026 14.3313 4.9390 145.3263 11.6356 53.1835 28.7472 11.5386 23.4880 6.9080 24.6219 8.6765 41.3086 27.0069 4.3478 8.2954 101.4895 44.7009 18.3573 7.8733 29.8410 50.9402 6.8533 15.8320 110.6150 18.7126 210.9742 56.6196 3.8163 136.0164 77.8526 148.4782 44.5871 41.7019 77.2951 37.1598 17.0229 49.3887 16.4496 10.8995 11.5121 5.4735 32.8521
temp: 298.150 k
press: 1.00000 atm
elementType: 17 7 7 6 6 6 6 6 6 6 6 6 1 1 1 1 1 1 1 1 1 1 1 1 1
symmnumber: 1
zpe: 535858.6 jmol-1
zpe.correction: 0.204098 hartree
zpe.thermalcorrener: 0.217129 hartree
zpe.thermalcorrenthalpy: 0.218073 hartree
zpe.thermalcorrgfe: 0.163129 hartree
zpe.sumelectzpe: -919.382799 hartree
zpe.sumelectthermal: -919.369768 hartree
zpe.sumelectthermalent: -919.368824 hartree
zpe.sumelectthermalfe: -919.423768 hartree
dipole: 4.9046 1.0694 -0.0479
dipole: 5.0201
quadrupole: -85.0336 -72.8465 -81.7355
quadrupole: 3.5438 -0.0636 -0.0134
quadrupole: -5.1617 7.0253 -1.8636 3.5438 -0.0636 -0.0134
hfenergy: -919.5868971 hartree
pointgroup: C01 [X(C9H13Cl1N2)]
dipole: -1.9179667 0.4709115 0.0224835 debye
dipolederiv: -0.9199374 0.0653923 0.0032318 0.0796779 -0.1497908 -0.0009824 0.0034497 -0.0011967 -0.0818293 -0.8729944 -0.0168677 -0.0001643 0.0065874 -0.6077776 0.003224 -0.0039069 0.0031079 -0.5370767 -2.161317 -0.0000626 -0.0082547 -0.0918934 -0.277319 0.0146174 -0.0399816 0.0144378 -0.4811055 1.4801312 0.1042025 0.0108679 0.5889178 0.6258926 -0.0097456 0.0241851 -0.0106731 0.3245346 1.841315 -0.0973266 0.0008962 -0.4035434 -0.0657399 -0.0065232 -0.0068095 -0.0039754 0.133168 0.2416413 0.0134258 -0.1605461 0.0596502 0.374927 0.1490299 -0.2502593 0.1617715 0.326921 0.2247672 0.0254159 0.1518195 0.0723584 0.3669224 -0.1462219 0.2416891 -0.1597495 0.3439984 -0.3749888 -0.1066298 -0.0031241 0.4520634 0.0119063 0.000866 0.0086442 0.0030684 -0.2463452 -0.468275 0.114774 0.0006324 -0.3024648 0.0671078 0.0039164 -0.0039507 0.002731 -0.233501 -0.002929 0.16307 0.0025256 0.023276 0.1067032 0.0025738 -0.0001176 0.0014514 -0.0867609 -0.0499994 -0.1079312 -0.0009949 -0.0288018 0.1387584 0.002422 -0.0007927 0.0024189 -0.0837625 1.0517971 -0.129526 -0.0059288 -0.1205645 -0.1325354 0.0001277 -0.0044446 0.0009564 -0.1255083 -0.0476667 0.0326072 -0.04356 -0.1435505 -0.0365899 0.0901616 -0.0190555 0.1409576 -0.0959606 -0.035882 0.0432766 0.0494905 -0.1261565 -0.0357704 -0.0889107 0.0339392 -0.1357983 -0.0826494 0.1597941 -0.0055592 0.0017785 -0.0600356 0.0738602 -0.0074537 0.0165494 -0.0098239 0.3049739 0.035903 -0.1083484 0.0138389 -0.0205758 -0.2568035 -0.1567988 0.0687897 -0.0207954 -0.0203926 0.1231304 0.0529739 -0.0990099 0.0402181 0.0107412 0.1054554 -0.0432757 0.0632573 -0.0887373 -0.2340545 0.01082 0.0501154 0.0005087 0.0788454 -0.0400159 -0.0278879 -0.019021 0.092534 0.1165162 0.0572043 0.1057793 0.0462564 0.0084901 -0.1043663 0.0518724 -0.0618677 -0.0798973 0.0424417 -0.1089252 -0.0090425 -0.0300001 -0.250259 0.1559388 -0.0649141 0.0168206 -0.0239683 -0.2332628 0.0098214 -0.0631568 -0.0005246 0.0797587 0.0402605 0.0141687 0.0202723 0.0898858 -0.013336 -0.0983908 0.000591 -0.1061726 -0.0206326 -0.0008336 0.0005188 -0.0014946 0.166676 -0.001725 0.1072983 0.001877 0.0787534 -0.0739408 -0.0028474 0.0010977 -0.0026198 0.1629901 0.0666027 0.0635626 0.0009792 0.0688247 -0.0325446 -0.0022184 0.0006769 -0.0023434 0.160287 0.032328 -0.0842772 -0.0006408 -0.0828089 -0.0042098 -0.0016756 -0.0001847 -0.0018924 0.1615262 unknown
polarizability: 192.0034891|-5.4149249|108.8684585|-0.2681913|0.4482843|69.7702669 unknown
InChI: InChI=1S/C9H13ClN2/c1-12(2)7-11-9-5-3-8(10)4-6-9/h3-6,11H,7H2,1-2H3
charge 0 multiplicity 1
25 atoms
Cl 4.894149 -0.265853 -0.00212
N  -3.49283 -0.315191 -0.019341
N  -1.131145 0.380988 0.023165
C  -2.106914 -0.745286 0.016933
C  0.252327 0.218155 0.019948
C  -4.020649 0.309913 1.204408
C  -3.958743 0.297572 -1.274177
C  0.85268 -1.078953 0.004626
C  1.112567 1.360164 0.030324
C  2.256988 -1.222705 -0.003173
C  2.51244 1.216225 0.024052
C  3.072567 -0.077549 0.006463
H  -1.952247 -1.368647 0.923184
H  -1.908589 -1.385247 -0.868164
H  -1.510754 1.326356 0.061548
H  -3.714955 1.375919 1.347889
H  -3.682735 -0.259951 2.08758
H  -5.125751 0.284592 1.183833
H  -3.581448 -0.283991 -2.133413
H  -3.639578 1.359406 -1.414611
H  -5.06367 0.276721 -1.30575
H  0.232614 -1.98007 0.000726
H  0.67754 2.367213 0.042357
H  2.705722 -2.220685 -0.015189
H  3.158511 2.099205 0.032205
