program: Gaussian 16
title: tri-Al
version: ES64L-G16RevC.01
frameworkgroup: C1[X(C21H42AlO18P3)]
method: RPBE1PBE
basis: GenECP
operation: Freq
keyword: #P
keyword: Geom=AllCheck
keyword: Guess=TCheck
keyword: SCRF=Check
keyword: GenChk
keyword: RPBE1PBE/GenECP
keyword: Freq
converged: YES YES NO YES
title: Mulliken charges:
elementType: O P O O C H H C H H C H H O C H H C O O C H H H C H H O P O O C H H C H H C H H O C H H C O O C H H H C H H H O P O O C H H C H H C H H O C H H C O O C H H H C H H H H Al
charge: -0.489655 1.436382 -0.473741 -0.788537 -0.575672 0.271489 0.301209 -0.333038 0.316728 0.238405 -0.293395 0.273376 0.228215 -0.519353 -0.359836 0.248700 0.283820 0.405887 -0.408988 -0.644782 -0.704494 0.236829 0.282318 0.234240 -0.708728 0.311693 0.232842 -0.480568 1.383006 -0.494397 -0.807946 -0.555661 0.266591 0.283700 -0.271357 0.246418 0.248090 -0.286039 0.240451 0.291366 -0.327582 -0.384033 0.316837 0.235854 0.410229 -0.380269 -0.704785 -0.718337 0.281262 0.224878 0.247123 -0.708643 0.247934 0.283607 0.231287 -0.502452 1.379020 -0.523343 -0.628808 -0.621038 0.253743 0.351925 -0.283558 0.242937 0.230884 -0.273582 0.226050 0.244425 -0.342412 -0.360068 0.237516 0.235522 0.469301 -0.654564 -0.446564 -0.674411 0.232125 0.248818 0.228896 -0.689027 0.227151 0.217267 0.268255 0.227310 2.157750
chargesum: -0.00000
title: Mulliken charges with hydrogens summed into heavy atoms:
elementType: O P O O C C C O C C O O C C O P O O C C C O C C O O C C O P O O C C C O C C O O C C Al
charge: -0.489655 1.436382 -0.473741 -0.788537 -0.002974 0.222095 0.208197 -0.519353 0.172684 0.405887 -0.408988 -0.644782 0.048893 0.063117 -0.480568 1.383006 -0.494397 -0.807946 -0.005369 0.223151 0.245778 -0.327582 0.168658 0.410229 -0.380269 -0.704785 0.034926 0.054186 -0.502452 1.379020 -0.523343 -0.628808 -0.015370 0.190262 0.196893 -0.342412 0.112971 0.469301 -0.654564 -0.446564 0.035428 0.023646 2.157750
chargesum: 0.00000
polarizability: 4.11553248e+02 -1.18121310e+01 3.74185443e+02 -4.61838479e+00 2.48807604e+00 3.47367019e+02
1716.lowfreq: -7.0368 -0.0482 -0.0012 0.0009 0.0010 4.4833 14.6814 22.4680 34.0280
frequency: 14.2769 22.4031 33.9690 35.7341 39.1170 44.4200 45.5779 48.8407 51.4067 55.3046 61.3908 65.8348 68.1500 71.8149 72.2913 76.3191 77.6732 80.6797 85.2805 86.9317 90.6246 92.5298 94.9870 104.0771 106.9330 116.9878 122.4903 127.0933 131.6591 139.8734 143.4789 150.3953 155.9897 161.2677 172.1110 180.0914 194.7345 203.7326 212.3606 216.2573 225.1532 229.1575 230.2784 240.8787 242.5698 247.3971 249.1961 256.3262 262.8099 272.3009 274.2116 280.2330 281.3242 289.3690 290.0337 295.3638 301.6322 312.1093 313.3591 337.7353 356.1008 359.9643 371.1064 386.0255 389.5047 390.9779 395.1601 397.8481 423.0262 438.0244 442.7275 452.5155 468.2683 478.4998 479.5899 485.5714 492.9836 502.5675 538.2051 548.1582 555.4324 561.1219 576.8830 597.5360 612.9262 615.4033 642.1841 684.8207 709.0679 727.2434 748.6014 755.6201 772.1447 791.9907 793.1448 795.0408 805.6753 809.2984 809.9549 818.9103 819.7137 824.7196 829.7171 834.2173 838.8882 904.5970 908.5027 916.7477 947.3775 956.5370 964.2603 965.1027 968.3372 970.4559 974.4804 978.7732 994.2840 997.3905 1003.1894 1035.5536 1039.0596 1052.6043 1058.0725 1058.8253 1063.1060 1087.0574 1091.0461 1101.1866 1113.9680 1129.1732 1129.8967 1131.5131 1132.8914 1133.8396 1136.3743 1157.9612 1165.2974 1178.2395 1195.6740 1197.5134 1198.0683 1200.2596 1201.7291 1203.8111 1208.3367 1223.5461 1244.0619 1248.0546 1269.5076 1281.8835 1292.8603 1294.9115 1319.2547 1332.5564 1334.5809 1335.6714 1337.6575 1339.7541 1346.8528 1351.4735 1365.7577 1368.3526 1369.3804 1382.3862 1393.9569 1401.7689 1402.4796 1405.2277 1405.9978 1406.8274 1408.5603 1413.5463 1414.9337 1429.1371 1431.1061 1434.3379 1436.2290 1436.7151 1446.1623 1454.3566 1460.2925 1474.7558 1481.4127 1485.7298 1491.2916 1493.6064 1494.4502 1494.8247 1496.8450 1497.4676 1500.0629 1502.8152 1511.4051 1511.9492 1513.0827 1514.3145 1516.0061 1521.5342 1528.4066 1529.8357 1531.0474 1533.4181 1538.3345 1543.5765 1745.9235 1781.7450 1821.5173 3037.9794 3043.3082 3049.8836 3056.2265 3056.5216 3060.2250 3061.8300 3063.8746 3067.0018 3069.0360 3079.3986 3080.6160 3084.6617 3088.0486 3088.8191 3092.9181 3095.7739 3119.0039 3124.6435 3125.4756 3129.6166 3134.9284 3136.7210 3138.3515 3139.7565 3140.6821 3140.8063 3140.8599 3146.1566 3146.8914 3149.3981 3151.0560 3152.7809 3155.3932 3157.6660 3161.2595 3162.3646 3163.1373 3172.9705 3174.5469 3182.1928 3184.0119
redmass: 3.9881 4.2510 3.7802 3.3316 3.2286 4.2175 3.6085 5.5734 6.3735 4.0122 3.8687 4.0948 3.6360 3.4036 5.2958 3.2727 4.9460 2.7755 4.7204 4.8081 3.0952 4.5314 3.5137 4.2033 3.3953 3.8466 4.0112 5.6141 5.3956 4.4509 3.6878 4.1832 3.6232 3.8595 2.9990 4.2519 2.9286 3.7153 3.3817 3.8013 2.5171 3.1402 3.6063 5.1498 3.5098 1.7658 2.3874 2.9814 1.9136 1.7417 1.8065 2.6981 1.8262 1.5849 1.7265 3.1573 2.5775 3.4843 5.4600 7.6599 5.9718 4.4694 4.7234 5.4411 4.8493 3.8716 3.4680 4.0311 4.2449 6.5799 4.1001 4.5908 5.5615 3.8172 5.4689 5.5355 6.4403 5.8977 6.4834 6.9065 5.8618 5.3185 6.3085 6.8491 3.5429 3.9063 6.2716 6.3743 4.1268 4.9455 4.5759 5.2177 3.5613 2.6294 2.8408 3.2064 1.5745 1.5342 2.4082 1.2504 1.1736 1.2906 1.9483 2.4288 1.4358 1.7736 1.9711 1.6766 7.4605 2.4284 4.6129 2.5145 4.7671 2.7980 2.8416 2.9025 3.4387 3.6678 2.7438 2.6315 3.4378 5.9228 3.1761 2.2696 3.7988 5.3567 5.4478 4.9057 5.2601 2.0999 2.1341 2.1776 2.0829 2.1371 2.0935 8.6497 4.4138 5.4715 4.5672 1.7021 1.6386 1.7369 1.7068 1.7221 1.9227 5.6196 1.0735 2.7136 1.1222 1.4536 1.3094 1.3892 1.1227 1.1853 1.0980 1.1034 1.1009 1.1028 1.2018 1.1252 2.5326 1.5678 1.4983 1.9607 1.3163 1.2670 1.2210 1.4251 1.2426 1.2265 1.4561 2.0116 1.2566 1.3527 1.3302 1.3133 1.3396 1.3385 1.2761 3.7340 1.0764 1.0891 1.1043 1.1209 1.1230 1.0920 1.0400 1.0443 1.0368 1.0449 1.0363 1.0502 1.0472 1.0486 1.0546 1.0645 1.0631 1.0544 1.0730 1.0735 1.0714 1.0782 1.0794 1.0770 10.5235 11.8520 12.2232 1.0658 1.0663 1.0668 1.0405 1.0559 1.0370 1.0375 1.0369 1.0374 1.0373 1.0689 1.0602 1.0563 1.0653 1.0600 1.0630 1.0561 1.0617 1.1033 1.1053 1.1059 1.0952 1.1004 1.1018 1.1016 1.0991 1.1025 1.1006 1.0999 1.0998 1.1033 1.1060 1.1078 1.1061 1.0996 1.1047 1.1097 1.1000 1.1079 1.1045 1.1009 1.1105
irintensity: 0.3849 1.4276 0.5890 0.9028 1.1192 0.3535 2.4082 3.5628 1.1240 1.3787 1.2454 8.5202 1.9839 2.0737 4.5492 0.3900 1.5306 0.9767 3.8088 3.2391 2.5603 1.5423 1.2857 3.0460 1.0322 6.2436 2.4021 1.3871 8.5452 0.4757 3.7108 2.8904 4.1373 15.5928 8.6278 4.9829 2.0024 7.3013 5.8701 3.6552 26.9555 21.7655 10.7558 6.3362 3.2567 7.0339 4.0567 10.7089 1.7828 0.0909 6.8262 1.6271 1.5672 7.7288 5.2710 4.6945 8.5764 10.7903 25.8276 61.5848 5.8265 4.8814 25.1072 0.5722 17.3104 14.4736 2.1133 1.4649 66.1755 51.6537 23.9893 36.4969 146.0883 20.4351 1.6258 48.8376 15.5144 20.4895 160.9388 52.5995 48.6606 6.5450 98.3164 210.1816 29.5382 117.0742 85.5473 48.2419 16.9421 5.5179 8.0755 67.9395 109.5004 31.1365 25.9924 89.8435 20.4618 6.3560 78.4168 13.1098 6.8689 3.4502 74.2261 58.8679 41.2604 8.0597 26.2386 10.2945 81.8776 86.0582 47.2479 82.9561 96.9393 83.3558 50.5577 214.1984 87.8465 11.8974 95.5656 92.0713 248.3116 61.5936 169.0844 1.8614 340.7964 387.9731 301.7265 265.7699 311.6838 25.4339 13.5458 19.9318 74.4367 51.5971 28.9469 59.7726 159.9260 42.4309 492.5352 54.1743 15.0594 21.0052 56.7394 15.7737 119.6412 189.6559 4.1976 127.5660 16.4772 169.0118 156.0615 8.6155 9.9842 9.5718 4.0891 10.6363 8.0679 17.2769 29.6270 14.1275 364.9271 47.6226 46.4123 124.4542 12.1339 25.5453 3.9125 122.3313 9.3469 6.2925 163.4644 47.1475 10.8706 18.4653 22.0458 19.1135 14.7409 23.7151 20.2194 281.1923 6.6785 8.3116 3.8755 33.3954 8.2067 9.9769 9.5689 3.5411 5.5595 14.9680 11.4126 6.9213 0.2118 2.2549 3.5128 4.0323 0.7998 7.7329 5.0938 11.7657 6.2824 7.4640 6.1220 5.0631 466.0283 691.5970 588.2677 42.5730 51.6560 51.6338 20.1439 39.0327 23.0942 26.5883 23.4373 16.6800 16.4888 38.0145 49.5134 18.2768 29.2464 26.1139 33.1580 32.4214 28.7543 5.6386 10.5643 8.9312 18.4903 37.4243 26.5948 20.5331 13.0275 30.8857 14.1121 23.7967 9.4639 7.2065 9.9739 5.0658 14.6693 23.8215 34.8978 4.8794 6.9500 6.9148 26.1727 14.8299 10.3978
temp: 298.150 k
press: 1.00000 atm
elementType: 8 15 8 8 6 1 1 6 1 1 6 1 1 8 6 1 1 6 8 8 6 1 1 1 6 1 1 8 15 8 8 6 1 1 6 1 1 6 1 1 8 6 1 1 6 8 8 6 1 1 1 6 1 1 1 8 15 8 8 6 1 1 6 1 1 6 1 1 8 6 1 1 6 8 8 6 1 1 1 6 1 1 1 1 13
symmnumber: 1
zpe: 1792287.1 jmol-1
zpe.correction: 0.682646 hartree
zpe.thermalcorrener: 0.733930 hartree
zpe.thermalcorrenthalpy: 0.734874 hartree
zpe.thermalcorrgfe: 0.594908 hartree
zpe.sumelectzpe: -3443.529039 hartree
zpe.sumelectthermal: -3443.477755 hartree
zpe.sumelectthermalent: -3443.476811 hartree
zpe.sumelectthermalfe: -3443.616777 hartree
dipole: -2.8109 -0.3355 9.3528
dipole: 9.7718
quadrupole: -250.4031 -265.6704 -285.8731
quadrupole: 17.2443 21.6422 -16.8685
quadrupole: 16.9125 1.6451 -18.5576 17.2443 21.6422 -16.8685
hfenergy: -3444.2116848 hartree
pointgroup: C01 [X(C21H42Al1O18P3)]
dipole: 1.1033456 0.0960801 3.6815599 debye
polarizability: 411.434057|-12.0226919|374.3369153|4.5611565|-2.2948307|347.334738 unknown
InChI: InChI=1/21C.Al.18O.3P.42H
charge 0 multiplicity 1
85 atoms
O  0.29886651 1.49946952 2.88023924
P  0.25418593 1.53959336 1.30659693
O  1.68600866 1.81704634 0.73300722
O  -0.30578824 0.29155412 0.68626658
C  -0.89143684 2.89278834 0.85648837
H  -1.45518548 3.24382001 1.72466462
H  -0.35505638 3.71400348 0.37696641
C  0.92871598 0.33724182 3.52490122
H  1.6852829 -0.0733773 2.8512339
H  1.41650197 0.75437826 4.40564964
C  2.51796164 2.96739442 0.98362354
H  3.1353687 3.02773997 0.08958675
H  1.89433505 3.8656911 1.0304535
O  -1.74688399 2.26259869 -0.08061933
C  -2.5208843 3.10767059 -0.9322829
H  -3.32506857 3.57265471 -0.35875311
H  -1.86729096 3.86321868 -1.37315622
C  -3.09904458 2.23874271 -2.0485112
O  -3.98304483 2.69579831 -2.73883337
O  -2.56532072 1.06738369 -2.16223072
C  3.34852139 2.7801132 2.22695237
H  2.72983079 2.74468071 3.12640507
H  3.92443126 1.85670234 2.15001296
H  4.04417349 3.61773969 2.32915732
C  -0.11865201 -0.68512311 3.87376884
H  -0.5903567 -1.09001502 2.97652154
H  0.35518677 -1.51190669 4.41086496
O  -4.13170569 -1.32894571 2.04425099
P  -3.59112868 -1.41376675 0.5591544
O  -4.87831248 -1.70434864 -0.31987709
O  -2.90032152 -0.14741243 0.13912836
C  -2.5532415 -2.90371028 0.58672005
H  -3.04306723 -3.64976378 1.22340326
H  -2.51257728 -3.29333272 -0.43407672
C  -4.83537326 -0.15043327 2.50506296
H  -5.49063219 0.20968234 1.70692874
H  -5.4629567 -0.51106315 3.31970613
C  -5.01876285 -1.22099098 -1.68919228
H  -6.09299721 -1.26147018 -1.86602065
H  -4.68534458 -0.18388812 -1.73019906
O  -1.30038509 -2.55376774 1.09775031
C  -0.19576701 -2.86509553 0.27630822
H  0.68359357 -2.48838495 0.80341526
H  -0.09316995 -3.95143932 0.15653211
C  -0.16594794 -2.22412028 -1.1079891
O  0.73709735 -2.53673497 -1.85665442
O  -1.12684412 -1.39399275 -1.38719773
C  -4.2505881 -2.07250418 -2.66458994
H  -3.17241144 -1.98313006 -2.51191111
H  -4.54596201 -3.12260963 -2.5913377
H  -4.46110318 -1.72641253 -3.67973222
C  -3.87361663 0.91683585 2.96583778
H  -3.20169232 0.52412396 3.73175097
H  -3.27534855 1.28253842 2.13067767
H  -4.43269424 1.75343292 3.39429249
O  4.64522188 0.193971 0.43387458
P  3.50752169 -0.80924379 -0.09107102
O  4.26421106 -2.13520666 -0.591733
O  2.52821273 -1.05683124 0.99230595
C  2.95274222 -0.16602104 -1.7049302
H  3.58064809 -0.63045967 -2.4769214
H  1.92858138 -0.51690607 -1.85106238
C  5.77147065 0.58159187 -0.36948112
H  5.48378485 0.61480832 -1.42342185
H  5.99670363 1.60519783 -0.06384256
C  4.15970657 -3.39043035 0.10423821
H  5.17567338 -3.67238824 0.3925193
H  3.56894926 -3.24750272 1.01161896
O  3.06091858 1.23643682 -1.74776077
C  2.18131058 1.86024525 -2.66789527
H  2.61154513 2.83709255 -2.88688789
H  2.11089657 1.27717429 -3.59459985
C  0.79399064 2.05457187 -2.06179627
O  0.18236813 0.94586751 -1.83095236
O  0.38608714 3.18093131 -1.80625263
C  6.94799019 -0.33426457 -0.13520679
H  7.20280985 -0.36680352 0.92680386
H  6.7253375 -1.34850668 -0.47083577
H  7.82062227 0.0282419 -0.68612079
C  3.52704991 -4.40719026 -0.81146955
H  4.13459028 -4.55160529 -1.70837525
H  3.4375248 -5.37070183 -0.300567
H  2.53430426 -4.07264118 -1.12095357
H  -0.8853408 -0.25466072 4.52281487
Al -1.36233207 0.37023484 -0.92868024
