program: Gaussian 09
title: 000052765
version: EM64L-G09RevD.01
frameworkgroup: C1[X(C14H16N2OS)]
method: RPBEPBE
basis: SDD
operation: Freq
keyword: #p
keyword: freq=noraman
keyword: PBEPBE/SDD
title: #p freq=noraman PBEPBE/SDD
converged: YES YES NO NO
title: Mulliken charges:
elementType: S O N N C C C C C C C C C C C C C C H H H H H H H H H H H H H H H H
charge: 0.207159 -0.197846 -0.106301 -0.097584 -0.346337 -0.483936 0.304149 -0.168463 0.113234 -0.365761 -0.340183 -0.183584 -0.252577 -0.632377 -0.661014 -0.156684 -0.215527 -0.325195 0.252960 0.243719 0.255440 0.239294 0.281326 0.237236 0.250861 0.233037 0.214682 0.246043 0.227338 0.220845 0.240148 0.263449 0.252813 0.249636
chargesum: 0.00000
title: Mulliken charges with hydrogens summed into heavy atoms:
elementType: S O N N C C C C C C C C C C C C C C
charge: 0.207159 -0.197846 -0.106301 -0.097584 -0.093376 0.015223 0.304149 -0.168463 0.113234 -0.126467 -0.058857 0.053652 -0.001715 0.061385 0.027317 0.106766 0.037286 -0.075559
polarizability: 3.30760406e+02 1.76576809e+01 1.55050605e+02 3.93882600e+00 8.30281445e+00 1.15935491e+02
1716.lowfreq: -10.4563 -3.5260 0.0014 0.0018 0.0021 2.4773 14.0349 20.3051 30.0427
frequency: 13.0398 20.2813 29.6160 54.0804 58.9684 79.3408 96.9435 104.9205 156.3281 201.7503 211.7540 243.8337 249.4250 272.3025 290.5347 313.0136 328.4272 365.6611 391.3397 403.0263 426.3495 459.1262 519.0057 564.6903 590.7831 613.0619 627.7649 651.2198 666.2341 721.5162 723.2853 744.2565 762.6109 803.1485 815.0206 842.1382 850.8499 878.8067 882.4469 930.1678 941.9232 955.3704 966.6297 970.4200 999.0363 1003.0235 1014.2360 1054.5330 1056.3522 1073.3976 1108.2864 1126.3542 1133.2315 1164.8016 1168.8483 1197.9371 1225.0799 1237.9101 1245.7685 1270.3822 1303.9797 1313.7794 1319.1769 1346.8912 1356.9167 1363.9107 1384.9729 1401.8856 1418.7456 1434.7785 1461.0438 1462.0994 1468.2461 1474.8773 1479.5065 1485.6965 1486.9648 1548.8054 1591.5721 1612.5160 2980.0314 2981.0498 2985.9869 3025.6698 3048.2933 3073.5999 3081.8262 3093.4131 3098.2737 3135.2607 3138.9977 3161.6776 3165.1374 3224.8592 3227.8201 3258.1071
redmass: 4.2065 4.8018 5.1746 4.3543 3.6305 5.1778 4.1368 4.2635 5.0039 5.4259 1.0588 3.6985 1.3852 3.2492 3.9524 3.0939 2.9975 4.0007 3.1453 3.0194 3.9863 3.4531 7.0941 2.6842 3.8558 3.1015 7.0237 3.3755 5.9689 1.3147 3.8037 5.0896 1.4372 4.9907 1.4289 1.4347 1.3328 6.3001 2.6128 1.1771 1.6625 1.3927 1.8963 4.4004 1.3872 3.3357 3.2216 1.3601 1.7403 3.3367 1.8044 1.3982 2.3929 1.9032 1.4453 1.2122 1.5882 2.1950 1.2793 1.9072 1.3677 1.6655 1.3681 3.6723 4.1461 3.4755 1.2004 1.2024 4.3044 1.6957 1.0553 1.8208 1.0493 1.0466 2.8487 2.3890 1.0655 6.6725 7.0887 7.5289 1.0372 1.0625 1.0356 1.0858 1.0972 1.0977 1.0989 1.1006 1.1000 1.0878 1.0886 1.0950 1.0958 1.0965 1.0926 1.1092
irintensity: 1.4941 2.3377 0.3074 1.0214 3.2727 3.1245 0.3235 0.3873 3.8663 0.2459 0.1035 0.0782 0.1361 1.0929 3.2661 2.1045 2.5952 0.8829 3.0394 0.0168 2.1306 8.2384 30.9173 15.6514 8.5855 9.3252 2.1445 12.0501 13.6329 17.1241 1.7795 26.0653 70.8871 6.4298 35.7768 4.1982 25.3621 14.3705 1.9103 3.6996 1.1831 0.9962 14.3474 60.2916 0.8137 18.8628 50.8803 53.6550 28.3320 123.9715 14.6409 14.8410 2.9321 40.1671 3.9034 129.6359 42.8746 163.3617 61.6512 16.1923 1.9536 26.2912 1.3706 3.7301 22.9761 2.3681 21.4792 21.4209 19.3829 28.8534 12.3617 40.3386 2.8642 12.2575 18.9502 7.5649 15.1061 108.6301 392.1325 29.1733 26.4101 55.3690 33.8723 7.8733 5.2864 13.5342 38.1856 14.9871 34.7503 13.3523 1.5487 10.9308 5.5878 4.1032 3.1565 1.8963
temp: 298.150 k
press: 1.00000 atm
elementType: 16 8 7 7 6 6 6 6 6 6 6 6 6 6 6 6 6 6 1 1 1 1 1 1 1 1 1 1 1 1 1 1 1 1
symmnumber: 1
zpe: 707393.5 jmol-1
zpe.correction: 0.269432 hartree
zpe.thermalcorrener: 0.287384 hartree
zpe.thermalcorrenthalpy: 0.288328 hartree
zpe.thermalcorrgfe: 0.219768 hartree
zpe.sumelectzpe: -1124.545948 hartree
zpe.sumelectthermal: -1124.527996 hartree
zpe.sumelectthermalent: -1124.527052 hartree
zpe.sumelectthermalfe: -1124.595612 hartree
dipole: -8.7078 -3.4871 1.3163
dipole: 9.4720
quadrupole: -143.9954 -111.8988 -113.7778
quadrupole: 7.1913 9.6332 1.7246
quadrupole: -20.7714 11.3252 9.4462 7.1913 9.6332 1.7246
hfenergy: -1124.8153799 hartree
pointgroup: C01 [X(C14H16N2O1S1)]
dipole: 3.4170204 1.4574381 0.2950909 debye
polarizability: 331.0763291|16.784191|148.7290241|-0.1886855|-15.9948812|121.9411484 unknown
InChI: InChI=1S/C14H16N2OS/c1-11(2)18-13-5-3-12(4-6-13)14(17)9-16-8-7-15-10-16/h3-8,10-11H,9H2,1-2H3
charge 0 multiplicity 1
34 atoms
S  4.58557 -0.875157 0.217527
O  -2.223733 -1.633041 0.551182
N  -3.755628 0.583816 -0.234445
N  -5.870791 0.542457 -1.059653
C  5.271688 0.89167 -0.080424
C  -2.302345 0.696878 -0.2054
C  -0.079437 -0.589246 0.193252
C  2.774753 -0.67485 0.206023
C  -1.571601 -0.608308 0.206453
C  0.686925 0.550391 -0.175226
C  0.614654 -1.775402 0.570348
C  2.09454 0.51203 -0.170622
C  2.015361 -1.820631 0.579547
C  5.073927 1.775877 1.162648
C  6.754224 0.709276 -0.453006
C  -4.606207 0.358222 0.856588
C  -4.568866 0.682251 -1.367589
C  -5.899539 0.339543 0.33204
H  4.720216 1.291233 -0.950682
H  -1.960005 0.998886 -1.212473
H  -1.995836 1.502558 0.491466
H  0.19707 1.484229 -0.472506
H  0.022702 -2.651493 0.855133
H  2.648581 1.40641 -0.46945
H  2.531198 -2.74066 0.87543
H  5.643089 1.370076 2.017469
H  5.442185 2.800039 0.958332
H  4.014444 1.845866 1.462961
H  7.315576 0.229835 0.369472
H  7.209886 1.698903 -0.641112
H  6.8732 0.094227 -1.361554
H  -4.227129 0.200917 1.862142
H  -4.166713 0.855997 -2.36369
H  -6.838659 0.1868 0.858319
