program: Orca
programVersion: 4.2.1
elementType: Ru C H N H P P Fe C C C C C C C C C C H H H H H H H H C C C C C C H H H H H C C C C C C H H H H H C C C C C C H H H H H C C C C C C H H H H H C C C N C C H H H H H H H C H C H H O H O O C H H C H H O H
elementType: Ru
charge: 0
multiplicity: 1
keywords: RKS wB97M-V def2-TZVPP def2-tzvpp/c def2/j tightscf rijcosx GRID6
keywords: CPCM
formula: C44H46FeN2O4P2Ru
InChI: InChI=1/2C17H14P.C6H8N2.C4H8O4.Fe.Ru.2H/c2*1-3-9-15(10-4-1)18(17-13-7-8-14-17)16-11-5-2-6-12-16;7-5-6-3-1-2-4-8-6;5-1-2-8-4(7)3-6;;;;/h2*1-14H;1-4H,5,7H2;5-6H,1-3H2;;;;/q;;-1;;;+1;;/rC40H38FeN2P2Ru.C4H8O4/c1-5-16-27(17-6-1)44(28-18-7-2-8-19-28)39-35-31-32-36(39)41(31,32,35,39)33-34(41)38(41)40(41,37(33)41)45(29-20-9-3-10-21-29,30-22-11-4-12-23-30)46(44)42-25-26-15-13-14-24-43(26)46;5-1-2-8-4(7)3-6/h1-24,31-38H,25,42,46H2;5-6H,1-3H2
100 atoms
Ru 0.105514 0.24448 -0.563521
C  -0.59929 -1.047242 -3.262436
H  0.157285 -1.851688 -3.241674
N  0.04098 0.195126 -2.850283
H  -0.603935 0.96779 -3.055022
P  1.350444 -1.619016 -0.047284
P  1.741535 1.774145 -0.16963
Fe 4.428226 -0.372795 -0.505726
C  4.785896 -1.398505 -2.228383
C  4.649128 1.625459 -0.76417
C  3.389793 -1.200383 -2.016726
C  5.301497 -2.110505 -1.104917
C  5.8160 1.075116 -0.155423
C  3.51539 1.327179 0.068397
C  3.027322 -1.785101 -0.753639
C  4.226696 -2.354408 -0.198437
C  5.425211 0.448549 1.063682
C  4.015176 0.604615 1.206302
H  5.36096 -1.04488 -3.084131
H  4.626826 2.161637 -1.712258
H  2.704261 -0.667756 -2.67634
H  6.343097 -2.391066 -0.946879
H  6.825306 1.110154 -0.565752
H  4.317852 -2.839011 0.773447
H  6.079893 -0.086093 1.751942
H  3.413802 0.223407 2.031312
C  1.660721 -2.064387 1.728547
C  2.108743 -3.349069 2.075575
C  1.432001 -1.138767 2.752935
C  2.335475 -3.691071 3.407603
C  1.660216 -1.477932 4.087621
C  2.112679 -2.754319 4.418409
H  2.277517 -4.096795 1.29429
H  1.066947 -0.139832 2.494875
H  2.682959 -4.696768 3.657842
H  1.477143 -0.739257 4.872167
H  2.285886 -3.023165 5.463522
C  0.575509 -3.204762 -0.599249
C  -0.529714 -3.698594 0.111689
C  0.987261 -3.88714 -1.751633
C  -1.210744 -4.832817 -0.323288
C  0.307106 -5.026556 -2.186994
C  -0.795981 -5.500447 -1.47761
H  -0.858521 -3.188138 1.022924
H  1.852483 -3.529849 -2.318744
H  -2.071943 -5.197831 0.243053
H  0.647399 -5.549015 -3.084949
H  -1.328473 -6.391555 -1.819138
C  1.947095 3.020625 -1.525566
C  1.702862 4.389704 -1.366779
C  2.336221 2.557776 -2.792626
C  1.852408 5.269227 -2.439589
C  2.489014 3.434213 -3.864106
C  2.24576 4.798064 -3.689452
H  1.385314 4.78456 -0.398063
H  2.557485 1.494749 -2.93027
H  1.652188 6.333943 -2.294141
H  2.806335 3.052068 -4.83804
H  2.362302 5.489346 -4.527865
C  1.557322 2.906318 1.288278
C  0.28953 3.101316 1.846988
C  2.640372 3.624452 1.817828
C  0.099345 3.992149 2.903849
C  2.454949 4.508753 2.879816
C  1.183737 4.696555 3.425598
H  -0.551341 2.536677 1.437826
H  3.641009 3.503054 1.392192
H  -0.900777 4.130982 3.323952
H  3.310115 5.057654 3.282651
H  1.041068 5.390569 4.257762
C  -3.78105 -2.534342 -1.831825
C  -3.68699 -2.043185 -0.531016
C  -2.590443 -1.262642 -0.189901
N  -1.61071 -0.961726 -1.059135
C  -1.709329 -1.412529 -2.327825
C  -2.781628 -2.204866 -2.739812
H  -4.62579 -3.156133 -2.136395
H  -4.449529 -2.25813 0.219721
H  -2.478537 -0.859188 0.818915
H  -2.821725 -2.551195 -3.774667
H  -0.985118 -1.016853 -4.29626
H  0.873387 0.35182 -3.413815
H  -0.305749 0.31616 0.998572
C  -2.316781 2.136947 -1.554077
H  -1.009516 1.578438 -0.821351
C  -1.904265 3.613278 -1.464221
H  -1.282926 3.834624 -0.580954
H  -2.850454 4.18968 -1.348904
O  -1.214796 3.962299 -2.618611
H  -1.517138 3.306377 -3.272516
O  -2.397854 1.650834 -2.695398
O  -3.272302 1.730846 -0.652413
C  -3.142575 2.100495 0.71176
H  -2.902203 3.171222 0.831743
H  -2.319844 1.508972 1.157932
C  -4.458474 1.795441 1.37677
H  -5.233792 2.479541 0.977468
H  -4.375308 2.005041 2.45343
O  -4.834088 0.450199 1.229523
H  -4.769405 0.257601 0.282923
elementType: Ru C H N P Fe O
totalener: -4156.14690072 hartree
cpcmener: -0.03645749 hartree
kineticenergy: 4084.89551404 hartree
exchangeener: -286.183447750716 hartree
correlationener: -14.663821197136 hartree
xcener: -299.333579428861 hartree
chargesum: 0.0000000
charge: -0.498165 -0.109973 0.160418 -0.269458 0.205316 0.694436 0.616672 0.149038 -0.110854 -0.194940 -0.346414 -0.195114 -0.184651 -0.010583 0.145883 -0.166432 -0.099284 -0.355848 0.134934 0.156332 0.165018 0.136730 0.135789 0.155414 0.136060 0.163773 -0.095046 -0.219829 -0.204657 -0.168569 -0.176600 -0.144720 0.174123 0.160990 0.153198 0.155801 0.154315 -0.029827 -0.202945 -0.218874 -0.173604 -0.177128 -0.148383 0.169525 0.174545 0.145825 0.154643 0.152617 0.209843 -0.173556 -0.364729 -0.178340 -0.202346 -0.148668 0.156085 0.189028 0.143187 0.154869 0.150640 -0.178716 -0.061562 -0.113401 -0.209029 -0.183878 -0.122376 0.098713 0.164483 0.150287 0.154170 0.153509 -0.093973 -0.193623 -0.015516 -0.077394 0.226053 -0.205140 0.161373 0.162784 0.185171 0.142073 0.141107 0.154447 -0.208998 0.465836 -0.324108 -0.036640 0.093912 0.129126 -0.361959 0.189163 -0.512091 -0.279344 -0.076677 0.135578 0.139143 -0.016522 0.098823 0.099468 -0.372751 0.212973
charge: -0.641710 -0.052424 0.038600 0.350958 -0.041253 0.865358 0.853877 -0.489102 0.025300 0.011916 0.005123 0.025463 0.022453 -0.175791 -0.182888 0.017876 0.025427 0.016147 0.036789 0.035283 0.033219 0.036973 0.036180 0.036935 0.037038 0.035972 -0.189131 -0.028016 -0.035974 -0.026491 -0.026005 -0.018582 0.033323 0.021086 0.028415 0.028410 0.028654 -0.194970 -0.024636 -0.039200 -0.020183 -0.028164 -0.024022 0.034929 0.028923 0.028545 0.027228 0.026829 -0.179081 -0.023876 -0.037649 -0.020323 -0.029292 -0.024262 0.027991 0.026904 0.026835 0.026792 0.026026 -0.193960 -0.035547 -0.024124 -0.027171 -0.026635 -0.019371 0.017436 0.033669 0.027051 0.027998 0.028195 0.015737 -0.029192 -0.063046 0.263928 -0.120407 -0.000600 0.037009 0.032114 0.029663 0.035924 0.032089 -0.033521 -0.118846 -0.494062 -0.029650 -0.159914 0.014752 0.016154 0.275290 -0.151762 0.023148 0.272642 -0.127653 0.024027 0.014762 -0.141321 0.011429 0.024516 0.256614 -0.132119
qa: -0.4982 -0.1100 0.1604 -0.2695 0.2053 0.6944 0.6167 0.1490 -0.1109 -0.1949 -0.3464 -0.1951 -0.1847 -0.0106 0.1459 -0.1664 -0.0993 -0.3558 0.1349 0.1563 0.1650 0.1367 0.1358 0.1554 0.1361 0.1638 -0.0950 -0.2198 -0.2047 -0.1686 -0.1766 -0.1447 0.1741 0.1610 0.1532 0.1558 0.1543 -0.0298 -0.2029 -0.2189 -0.1736 -0.1771 -0.1484 0.1695 0.1745 0.1458 0.1546 0.1526 0.2098 -0.1736 -0.3647 -0.1783 -0.2023 -0.1487 0.1561 0.1890 0.1432 0.1549 0.1506 -0.1787 -0.0616 -0.1134 -0.2090 -0.1839 -0.1224 0.0987 0.1645 0.1503 0.1542 0.1535 -0.0940 -0.1936 -0.0155 -0.0774 0.2261 -0.2051 0.1614 0.1628 0.1852 0.1421 0.1411 0.1544 -0.2090 0.4658 -0.3241 -0.0366 0.0939 0.1291 -0.3620 0.1892 -0.5121 -0.2793 -0.0767 0.1356 0.1391 -0.0165 0.0988 0.0995 -0.3728 0.2130
va: 5.1217 3.8053 0.9731 3.1629 1.0057 3.9501 4.0543 4.5108 3.8370 3.6250 3.7784 3.9609 3.9564 3.4465 3.2452 3.6795 3.8364 3.7183 1.0011 1.0060 1.0294 1.0038 1.0035 1.0112 1.0009 1.0404 3.5115 3.7768 3.8298 3.9343 3.9746 3.8894 0.9828 1.0176 0.9874 0.9862 0.9850 3.5032 3.7877 3.7661 3.8725 3.9573 3.8700 0.9818 0.9777 0.9920 0.9857 0.9848 3.3530 3.8157 3.8997 3.9624 4.0072 3.9145 0.9819 0.9784 0.9876 0.9862 0.9842 3.7459 3.7291 3.7307 3.9861 3.9300 3.8721 1.0257 0.9891 0.9893 0.9873 0.9854 3.8886 3.8045 3.7469 3.1029 3.5780 3.9401 0.9819 0.9926 0.9826 0.9952 0.9862 1.0054 0.9682 3.9795 0.8584 3.8737 0.9553 0.9768 2.0263 1.0754 1.9577 1.9719 3.7570 0.9783 0.9675 3.9713 0.9817 0.9806 2.0118 1.0325
energy: -4156.146900718581
dipole: 19.53564 -18.34385 1.19179 3.08129 -4.87864 -1.79735 17.84434 -18.52207 -0.67773
magnitude: 2.26057 au
magnitude: 5.74591 debye
