program: Orca
programVersion: 4.2.1
elementType: Ru C H N H P P Fe C C C C C C C C C C H H H H H H H H C C C C C C H H H H H C C C C C C H H H H H C C C C C C H H H H H C C C C C C H H H H H C C C N C C H H H H H H H C H H C H H O H O
elementType: Ru
charge: 0
multiplicity: 1
keywords: RKS wB97M-V def2-TZVPP def2-tzvpp/c def2/j tightscf rijcosx GRID6
keywords: CPCM
formula: C42H42FeN2O2P2Ru
InChI: InChI=1/2C17H14P.C6H8N2.C2H4O2.Fe.Ru.2H/c2*1-3-9-15(10-4-1)18(17-13-7-8-14-17)16-11-5-2-6-12-16;7-5-6-3-1-2-4-8-6;3-1-2-4;;;;/h2*1-14H;1-4H,5,7H2;1,4H,2H2;;;;/q;;-1;;;+1;;/rC40H38FeN2P2Ru.C2H4O2/c1-5-16-27(17-6-1)44(28-18-7-2-8-19-28)39-35-31-32-36(39)41(31,32,35,39)33-34(41)38(41)40(41,37(33)41)45(29-20-9-3-10-21-29,30-22-11-4-12-23-30)46(44)42-25-26-15-13-14-24-43(26)46;3-1-2-4/h1-24,31-38H,25,42,46H2;1,4H,2H2
92 atoms
Ru 0.027362 0.141356 -0.43058
C  -1.259161 -1.066589 -2.951953
H  -0.607355 -1.948195 -3.085306
N  -0.413329 0.084131 -2.660193
H  -0.953323 0.950137 -2.808162
P  1.252794 -1.795566 -0.114225
P  1.727978 1.629776 -0.428706
Fe 4.236839 -0.608933 -1.131108
C  4.26082 -1.681383 -2.863034
C  4.501018 1.374461 -1.475796
C  2.928271 -1.446366 -2.413307
C  4.953167 -2.379893 -1.829858
C  5.721768 0.782656 -1.034539
C  3.497019 1.145545 -0.473312
C  2.783042 -1.995069 -1.092456
C  4.050354 -2.579032 -0.742425
C  5.494866 0.199353 0.246078
C  4.130716 0.421851 0.595143
H  4.681634 -1.360793 -3.81608
H  4.359865 1.895732 -2.42196
H  2.144461 -0.920462 -2.958907
H  6.000855 -2.680613 -1.850096
H  6.6573 0.762064 -1.593683
H  4.301017 -3.045228 0.210454
H  6.223394 -0.351421 0.840936
H  3.641274 0.083892 1.508918
C  1.84292 -2.273117 1.577711
C  2.293147 -3.576796 1.840826
C  1.835619 -1.344414 2.624535
C  2.734936 -3.935527 3.11312
C  2.280038 -1.700702 3.898992
C  2.730115 -2.996582 4.14642
H  2.295465 -4.324471 1.041299
H  1.472322 -0.329815 2.432551
H  3.080772 -4.955475 3.299873
H  2.267627 -0.960321 4.70293
H  3.072585 -3.278646 5.145275
C  0.339996 -3.339846 -0.557408
C  -0.654711 -3.813141 0.313698
C  0.521269 -3.99601 -1.782517
C  -1.450492 -4.902275 -0.034504
C  -0.273931 -5.089625 -2.130807
C  -1.264864 -5.54371 -1.260969
H  -0.804244 -3.322909 1.281381
H  1.295005 -3.653833 -2.476682
H  -2.22161 -5.252384 0.657191
H  -0.111965 -5.59259 -3.087836
H  -1.887634 -6.399067 -1.534274
C  1.609173 2.736921 -1.906087
C  1.103386 4.041322 -1.81957
C  1.894671 2.21905 -3.179862
C  0.881698 4.798751 -2.970684
C  1.68526 2.978624 -4.329011
C  1.170936 4.272399 -4.22804
H  0.869562 4.475784 -0.843696
H  2.294268 1.204223 -3.271095
H  0.480036 5.811276 -2.879949
H  1.922783 2.556457 -5.30899
H  0.996624 4.8670 -5.128043
C  1.802187 2.890087 0.928084
C  0.647883 3.198888 1.659282
C  2.983618 3.592113 1.211428
C  0.672577 4.181092 2.649964
C  3.010923 4.567764 2.207175
C  1.855125 4.864544 2.930663
H  -0.285323 2.674302 1.437068
H  3.896247 3.381581 0.646071
H  -0.240373 4.410205 3.205672
H  3.94172 5.100954 2.417369
H  1.876944 5.62922 3.711312
C  -4.224354 -2.344521 -0.961868
C  -3.822741 -1.948019 0.312442
C  -2.621357 -1.267989 0.452591
N  -1.822512 -0.968793 -0.589738
C  -2.203436 -1.358876 -1.827398
C  -3.400648 -2.043645 -2.040905
H  -5.164958 -2.878429 -1.112878
H  -4.428433 -2.159904 1.194775
H  -2.265427 -0.948174 1.434462
H  -3.673963 -2.33278 -3.057814
H  -1.824796 -0.961852 -3.893607
H  0.348097 0.116658 -3.335242
H  -0.118019 0.297266 1.185628
C  -2.102873 2.536423 -1.226758
H  -1.52081 3.405785 -0.815351
H  -0.845125 1.60503 -0.553493
C  -3.134244 2.000751 -0.254233
H  -3.574613 1.077578 -0.68447
H  -3.953026 2.743169 -0.234536
O  -2.683793 1.847907 1.058184
H  -1.859092 1.322084 0.993924
O  -2.18709 2.35056 -2.444791
elementType: Ru C H N P Fe O
totalener: -3927.05257245 hartree
nucrepener: 8854.83136327 hartree
cpcmener: -0.03715715 hartree
kineticenergy: 3856.41575924 hartree
exchangeener: -266.134600181596 hartree
correlationener: -13.580765890637 hartree
xcener: -278.314694205295 hartree
chargesum: 0.0000000
charge: -0.540537 -0.130611 0.161900 -0.274802 0.227791 0.671212 0.631213 0.149706 -0.111897 -0.176274 -0.360118 -0.183756 -0.167245 0.001291 0.157452 -0.170721 -0.106660 -0.355466 0.136139 0.152005 0.161089 0.136056 0.135631 0.157505 0.134818 0.162833 -0.105687 -0.209255 -0.214761 -0.169026 -0.180064 -0.134924 0.169679 0.183080 0.153388 0.152737 0.154164 -0.021104 -0.207571 -0.222031 -0.169717 -0.169412 -0.153487 0.167974 0.177502 0.147898 0.151891 0.151768 0.205077 -0.222031 -0.394820 -0.167816 -0.191643 -0.152475 0.168558 0.206707 0.153477 0.155122 0.153702 -0.160814 -0.100751 -0.118700 -0.191634 -0.186890 -0.130658 0.130491 0.164753 0.152691 0.153680 0.153472 -0.105120 -0.123619 -0.044592 -0.083703 0.158435 -0.158362 0.163648 0.153862 0.168818 0.142324 0.143294 0.168644 -0.204540 0.250544 0.122899 -0.368383 -0.007305 0.088565 0.122858 -0.388523 0.243700 -0.474543
charge: -0.653866 -0.051228 0.040887 0.353121 -0.039091 0.862595 0.852068 -0.490130 0.025268 0.011711 0.003402 0.026010 0.023738 -0.179980 -0.182350 0.018820 0.027053 0.017276 0.037002 0.035107 0.032577 0.037127 0.036517 0.037409 0.037523 0.037286 -0.192327 -0.028069 -0.035457 -0.026650 -0.025537 -0.018270 0.033223 0.021708 0.028358 0.028523 0.028708 -0.196379 -0.026338 -0.038942 -0.020712 -0.027810 -0.024460 0.034114 0.029067 0.028497 0.027431 0.026839 -0.179271 -0.025735 -0.037751 -0.020003 -0.026709 -0.022751 0.028977 0.030059 0.028386 0.027995 0.027127 -0.192474 -0.033592 -0.024969 -0.026427 -0.026801 -0.019951 0.020274 0.032889 0.027706 0.027834 0.028127 0.017608 -0.019107 -0.063942 0.254473 -0.125647 0.000814 0.037800 0.034488 0.032133 0.037538 0.032610 -0.031428 -0.122050 -0.261259 0.007761 -0.044141 -0.163488 0.011759 0.026780 0.248774 -0.158283 0.022500
qa: -0.5405 -0.1306 0.1619 -0.2748 0.2278 0.6712 0.6312 0.1497 -0.1119 -0.1763 -0.3601 -0.1838 -0.1672 0.0013 0.1575 -0.1707 -0.1067 -0.3555 0.1361 0.1520 0.1611 0.1361 0.1356 0.1575 0.1348 0.1628 -0.1057 -0.2093 -0.2148 -0.1690 -0.1801 -0.1349 0.1697 0.1831 0.1534 0.1527 0.1542 -0.0211 -0.2076 -0.2220 -0.1697 -0.1694 -0.1535 0.1680 0.1775 0.1479 0.1519 0.1518 0.2051 -0.2220 -0.3948 -0.1678 -0.1916 -0.1525 0.1686 0.2067 0.1535 0.1551 0.1537 -0.1608 -0.1008 -0.1187 -0.1916 -0.1869 -0.1307 0.1305 0.1648 0.1527 0.1537 0.1535 -0.1051 -0.1236 -0.0446 -0.0837 0.1584 -0.1584 0.1636 0.1539 0.1688 0.1423 0.1433 0.1686 -0.2045 0.2505 0.1229 -0.3684 -0.0073 0.0886 0.1229 -0.3885 0.2437 -0.4745
va: 5.1719 3.8500 0.9743 3.1919 0.9868 3.9531 4.0678 4.5081 3.8311 3.6193 3.7833 3.9622 3.9248 3.3844 3.2248 3.6938 3.8416 3.7165 1.0012 1.0063 1.0306 1.0045 1.0037 1.0083 1.0017 1.0395 3.5505 3.7724 3.8397 3.9286 3.9690 3.8833 0.9844 1.0001 0.9873 0.9882 0.9852 3.5078 3.8149 3.7666 3.8837 3.9515 3.8756 0.9832 0.9765 0.9911 0.9866 0.9849 3.3357 3.8379 3.8425 3.9576 4.0068 3.9121 0.9831 0.9714 0.9855 0.9860 0.9836 3.7457 3.7151 3.7906 3.9865 3.9243 3.8748 1.0414 0.9878 0.9876 0.9881 0.9856 3.9296 3.8261 3.8370 3.0761 3.6711 3.8848 0.9820 0.9875 0.9835 0.9947 0.9871 0.9969 0.9801 3.7193 0.9648 0.8866 3.8565 0.9686 0.9803 1.9950 1.0073 1.9856
energy: -3927.052572450785
dipole: 42.20100 -41.53941 0.66159 -13.34681 10.63968 -2.70713 -0.21902 -1.23681 -1.45583
magnitude: 3.14415 au
magnitude: 7.99179 debye
