program: Gaussian 16
title: For excited state optimization with solvation, first TD job
version: ES64L-G16RevC.02
method: RM06L
basis: def2SVP/W06
operation: Freq
keyword: #P
keyword: Geom=AllCheck
keyword: Guess=TCheck
keyword: SCRF=Check
keyword: GenChk
keyword: RM06L/def2SVP/W06
keyword: Freq
converged: YES YES YES YES
title: Mulliken charges:
elementType: H H
charge: -0.000000 0.000000
chargesum: -0.00000
title: Mulliken charges with hydrogens summed into heavy atoms:
polarizability: 2.08118536e+00 -7.97278501e-01 1.76919644e+00 2.32721397e+00 -1.83671483e+00 6.35151885e+00
1716.lowfreq: -0.0000 0.0000 0.0001 86.7436 130.2220 4397.1465
frequency: 4397.1463
redmass: 1.0078
irintensity: 0.0000
temp: 298.150 k
press: 1.00000 atm
elementType: 1 1
symmnumber: 2
zpe: 26300.8 jmol-1
zpe.correction: 0.010017 hartree
zpe.thermalcorrener: 0.012378 hartree
zpe.thermalcorrenthalpy: 0.013322 hartree
zpe.thermalcorrgfe: -0.001500 hartree
zpe.sumelectzpe: -1.156799 hartree
zpe.sumelectthermal: -1.154439 hartree
zpe.sumelectthermalent: -1.153495 hartree
zpe.sumelectthermalfe: -1.168317 hartree
dipole: -0.0000 0.0000 -0.0000
dipole: 0.0000
quadrupole: -1.8821 -1.9082 -1.5525
quadrupole: -0.0645 0.1795 -0.1469
quadrupole: -0.1012 -0.1272 0.2284 -0.0645 0.1795 -0.1469
hfenergy: -1.1668166 hartree
pointgroup: D*H [C*(H1.H1)]
dipole: 0. 0. 0. debye
dipolederiv: 0. 0. 0. 0. 0. 0. 0. 0. 0. 0. 0. 0. 0. 0. 0. 0. 0. 0. unknown
polarizability: 2.0811854|-0.7972785|1.7691964|2.327214|-1.8367148|6.3515189 unknown
InChI: InChI=1/2H
charge 0 multiplicity 1
2 atoms
H  0.69848557 -4.82428558 7.19389274
H  0.41004043 -4.58825542 6.53739926
