program: Gaussian 09
title: 000052757
version: EM64L-G09RevD.01
frameworkgroup: C1[X(C15H12N2O)]
method: RPBEPBE
basis: SDD
operation: Freq
keyword: #p
keyword: freq=noraman
keyword: PBEPBE/SDD
title: #p freq=noraman PBEPBE/SDD
converged: NO NO NO NO
title: Mulliken charges:
elementType: O N N C C C C C C C C C C C C C C C H H H H H H H H H H H H
charge: -0.185640 -0.097755 -0.100448 0.230410 0.185355 0.393546 -0.524170 0.089079 -0.384072 -0.364051 -0.430855 -0.427444 -0.236885 -0.260134 -0.243764 -0.192747 -0.170095 -0.327372 0.268861 0.265691 0.269612 0.259541 0.246340 0.243373 0.239955 0.236070 0.236647 0.256521 0.273871 0.250559
chargesum: 0.00000
title: Mulliken charges with hydrogens summed into heavy atoms:
elementType: O N N C C C C C C C C C C C C C C C
charge: -0.185640 -0.097755 -0.100448 0.230410 0.185355 0.393546 0.010381 0.089079 -0.114459 -0.104510 -0.184514 -0.184071 0.003070 -0.024064 -0.007117 0.063774 0.103776 -0.076813
polarizability: 2.35043986e+02 2.58773098e+00 2.14594057e+02 1.58143161e+01 -1.84070411e+00 8.14143905e+01
1716.lowfreq: -10.5944 -6.6083 -0.0009 -0.0009 -0.0005 1.6236 7.5524 39.6619 54.9474
frequency: -9.2343 39.6240 54.9412 83.2606 109.9918 153.6853 177.1495 198.2289 258.2187 292.1729 330.1577 340.8548 393.1292 436.6529 468.6336 494.9251 519.0133 538.5622 573.2379 612.1216 637.3000 647.7773 652.9578 696.2165 713.5574 751.6243 776.9002 783.0785 788.6320 806.5223 820.2291 835.3415 842.1409 876.8396 886.2386 930.4224 934.4721 960.9968 970.6144 993.7960 999.1166 1005.9447 1026.5294 1049.5352 1059.6461 1095.9819 1105.4663 1149.6125 1162.1909 1179.5991 1192.3116 1219.0393 1237.2301 1247.8258 1268.2340 1283.6842 1311.3262 1335.5906 1362.0578 1370.2593 1403.0324 1412.5115 1438.0188 1442.2583 1451.7742 1459.9732 1479.7379 1516.2736 1569.8346 1588.2041 1599.5660 1628.6218 2998.0717 3102.5614 3128.1723 3130.7164 3137.7971 3148.5739 3153.5314 3167.4320 3168.3687 3219.4274 3243.5377 3252.4979
redmass: 5.3412 5.7048 4.4659 5.2171 6.1757 4.9705 4.5267 4.2744 5.5238 6.6864 3.5334 3.2399 3.8819 4.1240 3.2470 4.3834 5.4706 4.7584 3.2826 3.3003 4.6701 4.1998 3.3591 3.9628 1.2833 1.3038 1.9750 1.8691 3.6269 3.1880 2.0749 1.5278 2.8285 5.9583 1.7433 2.6863 1.5144 2.9697 1.4127 1.3895 1.3585 4.0349 2.7433 2.0398 1.9309 2.2711 1.7380 1.4448 1.4038 1.1011 1.3358 1.5804 1.8043 1.9087 1.9461 1.8327 1.7865 6.2156 2.1282 2.5725 2.6452 6.7921 2.2642 2.0865 2.3607 1.8994 2.2575 3.6979 7.3720 5.9929 7.9025 6.4781 1.0666 1.0952 1.0867 1.0876 1.0885 1.0912 1.0943 1.0995 1.0998 1.0908 1.1009 1.1067
irintensity: 0.6574 0.8068 0.4384 6.7674 0.9297 0.1047 2.5573 3.0298 0.1191 2.6947 11.0678 0.8859 0.1274 5.1263 0.1873 8.9654 9.9010 7.7965 1.4761 5.0710 3.7884 1.9742 19.8403 16.3695 51.1203 7.5978 72.6123 6.3760 26.4454 38.0953 44.7120 1.4182 6.9332 14.0002 5.4937 8.7238 0.2700 8.1284 6.9340 1.3562 2.4381 29.4766 10.4124 42.2656 4.4658 6.7835 18.6245 7.2303 3.4652 3.1938 18.4892 42.8503 5.8402 102.8333 10.3455 12.9284 11.5993 1.2962 12.0518 8.1184 3.3342 5.2295 7.0797 34.1700 6.7130 12.1938 14.0147 22.8567 117.4791 2.4404 75.6547 1.2493 17.2588 5.6965 0.3744 2.9170 6.3779 6.2822 19.4750 30.9601 10.0044 2.1160 2.5185 3.7559
temp: 298.150 k
press: 1.00000 atm
elementType: 8 7 7 6 6 6 6 6 6 6 6 6 6 6 6 6 6 6 1 1 1 1 1 1 1 1 1 1 1 1
symmnumber: 1
zpe: 609389.1 jmol-1
zpe.correction: 0.232104 hartree
zpe.thermalcorrener: 0.245415 hartree
zpe.thermalcorrenthalpy: 0.246359 hartree
zpe.thermalcorrgfe: 0.191245 hartree
zpe.sumelectzpe: -762.267404 hartree
zpe.sumelectthermal: -762.254094 hartree
zpe.sumelectthermalent: -762.253149 hartree
zpe.sumelectthermalfe: -762.308264 hartree
dipole: 7.0170 1.7627 2.9589
dipole: 7.8166
quadrupole: -118.6322 -92.0228 -109.9479
quadrupole: -4.2980 -5.3977 -5.3130
quadrupole: -11.7645 14.8448 -3.0802 -4.2980 -5.3977 -5.3130
hfenergy: -762.4995085 hartree
pointgroup: C01 [X(C15H12N2O1)]
dipole: -2.7969745 0.4984326 -1.1772555 debye
polarizability: 235.4275911|-0.7687138|214.2585392|14.8301365|-5.0272495|81.3663028 unknown
InChI: InChI=1S/C15H12N2O/c18-15(10-17-9-8-16-11-17)14-7-3-5-12-4-1-2-6-13(12)14/h1-9,11H,10H2
charge 0 multiplicity 1
30 atoms
O  1.356001 -2.164969 0.807031
N  2.766927 0.053888 -0.536957
N  4.867925 0.27693 0.288651
C  -0.752935 -1.216938 0.110383
C  -1.472721 0.038443 0.030617
C  -2.919585 -0.002063 -0.076362
C  1.529038 -0.56827 -1.019773
C  0.741566 -1.334393 0.082796
C  -1.463402 -2.42902 0.177629
C  -0.839068 1.322918 0.129639
C  -3.596461 -1.265924 -0.063766
C  -3.657252 1.225141 -0.157157
C  -2.884352 -2.458053 0.083407
C  -1.585754 2.50259 0.060655
C  -3.004976 2.457886 -0.102079
C  3.00404 1.433858 -0.40797
C  3.919443 -0.598864 -0.098325
C  4.301216 1.548792 0.09501
H  0.904929 0.192695 -1.510582
H  1.779525 -1.332937 -1.781516
H  -0.899094 -3.362001 0.277784
H  0.237904 1.390791 0.312936
H  -4.689121 -1.281662 -0.15317
H  -4.748959 1.179322 -0.24608
H  -3.409305 -3.418087 0.113022
H  -1.082053 3.471151 0.14893
H  -3.576154 3.390325 -0.159369
H  2.269848 2.177722 -0.708208
H  3.998896 -1.682103 -0.065941
H  4.856634 2.453233 0.331465
