program: Gaussian 16
title: For excited state optimization with solvation, firstTD job
version: ES64L-G16RevC.02
method: RM06L
basis: def2SVP/W06
operation: Freq
keyword: #P
keyword: Geom=AllCheck
keyword: Guess=TCheck
keyword: SCRF=Check
keyword: GenChk
keyword: RM06L/def2SVP/W06
keyword: Freq
title: For excited state optimization with solvation, first TD job
converged: YES YES YES YES
title: Mulliken charges:
elementType: Ru C H N P P Fe C C C C C C C C C C H H H H H H H H C C C C C C H H H H H C C C C C C H H H H H C C C C C C H H H H H C C C C C C H H H H H C C C N C C H H H H H H C H C H H O H O C H H C H H O H O H H
charge: 0.167076 0.223420 0.031745 -0.565838 0.356448 0.385083 -0.227426 0.007181 -0.012071 -0.013677 -0.010555 -0.006169 -0.199897 -0.177642 0.009646 -0.005096 0.010211 0.065874 0.059073 0.036900 0.069287 0.068021 0.061007 0.067486 0.047093 -0.142762 -0.020736 -0.020243 -0.052387 -0.045287 -0.045720 0.049690 0.049785 0.057066 0.052656 0.059782 -0.144087 -0.014075 -0.038020 -0.051066 -0.049756 -0.051630 0.056928 0.053363 0.053297 0.054406 0.057180 -0.086823 -0.076700 -0.032288 -0.037697 -0.010324 -0.060019 0.051671 0.021818 0.055742 0.047812 0.057366 -0.164442 -0.041126 -0.031034 -0.042670 -0.045686 -0.047763 0.073954 0.052475 0.053719 0.057228 0.059403 0.020342 -0.087033 0.117197 -0.358292 0.041435 -0.061266 0.073966 0.069101 0.107434 0.057709 0.020499 0.138999 0.228451 0.079139 0.185643 0.070241 0.060288 -0.384443 0.208425 -0.556298 0.157120 -0.049425 0.012581 0.189302 0.021167 0.015868 -0.403664 0.177015 -0.374085 -0.284481 0.336881
chargesum: -0.00000
title: Mulliken charges with hydrogens summed into heavy atoms:
elementType: Ru C N P P Fe C C C C C C C C C C C C C C C C C C C C C C C C C C C C C C C C C C C C C N C C C C O O C C O O
charge: -0.117405 0.275664 -0.426840 0.356448 0.385083 -0.227426 0.073055 0.047002 0.023223 0.058732 0.061852 -0.199897 -0.177642 0.070653 0.062390 0.057304 -0.142762 0.028953 0.029542 0.004679 0.007369 0.014063 -0.144087 0.042853 0.015343 0.002231 0.004650 0.005550 -0.086823 -0.025028 -0.010469 0.018046 0.037488 -0.002653 -0.164442 0.032828 0.021441 0.011049 0.011542 0.011640 0.094308 -0.017932 0.224632 -0.358292 0.041435 -0.003556 0.307590 0.316171 -0.176018 -0.219417 0.120276 0.226337 -0.226649 -0.374085
chargesum: 0.00000
polarizability: 8.12590437e+02 5.50426133e+01 9.33468158e+02 -3.76524553e+00 3.14858563e+01 8.36158855e+02
1716.lowfreq: -431.4432 -7.5054 -0.0027 -0.0027 -0.0007 3.5390 7.6731 21.8464 34.6302
redmass: 1.7252 5.9561 5.2523 5.7272 5.6095 5.3638 5.3136 4.5649 5.2952 5.0947 5.1716 4.8707 4.9948 4.5357 4.6255 4.7944 3.8500 5.2279 5.3032 5.7228 4.3790 4.4820 5.2674 4.4826 6.6685 4.5525 5.9303 6.5592 4.8794 4.3102 6.0187 4.6461 4.6139 4.3981 4.5218 4.3541 4.0058 5.5349 4.8146 2.8381 1.9841 3.5630 5.0002 4.7863 5.1620 5.4430 4.9421 5.0334 5.0027 4.8638 4.7299 3.5441 2.1340 3.6657 6.0939 3.7620 2.7703 1.5216 2.7812 2.9001 2.7001 2.9713 5.7930 5.4183 3.4559 5.2866 6.0482 6.6917 5.5595 4.7699 6.6968 6.2708 3.9870 5.5628 5.8159 6.7672 5.4030 6.0740 5.3795 2.2665 7.1246 4.4594 4.6925 6.0769 5.8488 6.3332 5.9186 4.3140 7.5123 7.1563 6.6233 5.8724 6.1327 6.5758 6.3759 1.5861 1.5686 1.5903 1.6602 1.1653 2.0462 1.9866 1.7460 1.4064 1.8351 2.0533 1.9693 1.6787 1.5852 1.7818 1.3100 3.5731 1.3060 3.1435 2.0943 1.2033 2.0766 1.3008 1.3752 1.2470 1.2504 1.3328 1.2454 1.4272 1.6897 2.3863 1.3396 1.9464 1.3025 1.4183 2.4789 2.6054 1.3433 1.3552 1.3374 1.3406 1.4209 1.3688 1.3897 1.5713 1.5363 1.4197 1.4036 1.3701 5.1211 4.3008 4.7387 4.9790 1.3259 1.3185 1.2959 1.2945 1.3536 6.6978 1.3375 2.1320 1.7226 1.6062 2.4156 2.4791 2.0096 1.5174 1.4262 2.3240 2.0512 1.5362 1.5776 1.5519 2.5172 1.5104 2.7081 2.6416 1.4727 2.7779 2.8281 2.5469 2.6142 2.5003 1.0733 1.0639 1.0625 1.0656 1.0616 1.1155 1.1328 1.1197 1.1189 1.1897 1.8889 4.0837 3.1999 1.5578 1.2236 1.1788 2.0502 1.1303 1.1330 1.3895 1.3612 1.3644 1.5235 1.3553 1.3478 1.2274 4.3500 5.6883 4.6524 1.1638 1.1901 6.5083 6.7567 7.3331 7.4282 1.3615 1.3749 1.3041 4.6391 5.5488 4.0363 1.3307 5.4444 1.0956 3.0708 2.9720 2.3983 2.3394 1.1842 2.3979 2.4193 1.3121 1.3156 1.5789 2.2785 2.2805 2.2787 2.2396 2.9169 6.6743 6.0909 6.0476 6.1498 6.1953 6.2750 6.3073 6.1535 6.2592 6.4207 1.1014 6.2936 1.0178 1.0602 1.0587 1.0690 1.0703 1.0998 1.1031 1.0929 1.0912 1.0968 1.0886 1.0874 1.0869 1.0888 1.0874 1.0861 1.0873 1.0880 1.0898 1.0897 1.0902 1.0906 1.0889 1.0952 1.0954 1.0955 1.0900 1.0959 1.1007 1.1007 1.1005 1.0965 1.0997 1.0889 1.0997 1.0896 1.0923 1.0950 1.0973 1.1065 1.1017 1.0994 1.0742 1.0657 1.0650
irintensity: 2064.0488 0.0241 0.3578 0.2591 1.9056 0.6329 0.8292 0.1402 0.4966 0.2598 0.3404 1.6244 0.3461 1.2665 2.2718 0.2381 1.8667 0.9899 0.9503 3.9279 0.9677 3.3928 0.6325 0.7306 0.5354 17.5181 2.1498 0.5065 5.6166 3.6542 1.7106 0.7693 15.7135 0.2647 44.0090 0.6235 2.0554 5.3414 1.0692 25.0865 41.7873 18.8100 0.9414 3.3157 20.7840 0.5572 7.3073 3.1797 6.0107 1.1974 0.6892 11.6984 179.5271 159.0195 29.8664 280.4433 80.8719 167.2664 3.2776 1.8136 13.6796 1.1165 33.6129 9.5024 26.4912 77.6256 71.8716 53.8705 46.1703 25.4227 132.2145 15.1043 37.4675 105.6912 194.7479 14.3028 77.6747 5.5716 62.8210 21.2452 140.2090 4.2984 5.8513 1.3298 1.9992 1.3215 2.9097 1.5428 31.2668 30.2740 6.1644 34.8850 26.3574 11.4481 39.2243 47.8364 34.2963 55.6964 79.3370 10.5106 2.4110 82.0185 32.6183 71.3361 1.2469 0.6767 3.1052 54.4792 67.1445 15.2417 5.7909 11.6565 21.7758 2.0232 66.8388 13.8328 1074.0811 6.7456 32.9317 1.5877 0.0553 9.3069 1.1678 1.9915 41.0738 3.0819 0.1825 0.4255 0.7008 6.5393 665.2693 97.9907 0.8467 2.3301 5.3923 0.4653 1.7980 0.2261 1.5115 16.8091 3.4226 0.7060 0.3851 0.2150 2.6778 0.9276 2.8629 2.3155 0.1578 0.7501 0.9727 20.0130 8.1973 0.7987 15.3886 89.7937 9.3394 8.7990 13.0094 5.4843 3.1656 4.1842 47.6173 188.9392 29.0479 11.6705 29.4003 3.7297 69.3371 3.7987 39.4339 39.3173 18.9551 39.8155 22.8820 189.0403 18.0417 133.6951 2.8159 0.3300 0.3072 0.3445 0.1032 3.0099 2.2759 13.5344 2.7868 33.5631 25.0761 41.5023 34.4966 9.5864 45.8057 12.1036 25.9836 6.4962 77.2998 10.6969 6.5650 6.0609 28.1647 3.7677 4.1078 50.1778 15.0793 17.1377 4.2170 27.7668 31.4494 1.7016 2.9079 5.8337 5.5562 12.1786 75.9571 28.0783 2.0218 3.3107 0.1146 70.5944 0.5257 8.9608 7.1325 1.9247 32.4880 27.2674 54.3896 9.4939 23.6889 71.6050 12.6210 124.2737 7.4223 10.2118 9.1117 8.2303 52.5194 8.8187 0.3322 2.4287 1.8933 4.0055 5.5504 0.2832 3.5921 1.1251 15.0957 47.5697 539.7897 587.8243 163.4308 62.3855 156.0197 51.9336 74.1421 125.6459 8.8098 69.7559 70.4487 3.3654 4.0551 3.0012 5.8142 1.7048 0.8861 4.0695 6.0082 0.9445 0.6883 2.3957 3.2535 4.3171 33.6226 34.6003 23.6010 0.0974 33.9944 40.3979 59.8690 38.9737 14.7518 30.1119 2.2919 15.8074 4.0916 0.3000 4.3946 6.0775 21.3377 9.6982 8.1471 0.1267 223.3571 140.9855
temp: 298.150 k
press: 1.00000 atm
elementType: 44 6 1 7 15 15 26 6 6 6 6 6 6 6 6 6 6 1 1 1 1 1 1 1 1 6 6 6 6 6 6 1 1 1 1 1 6 6 6 6 6 6 1 1 1 1 1 6 6 6 6 6 6 1 1 1 1 1 6 6 6 6 6 6 1 1 1 1 1 6 6 6 7 6 6 1 1 1 1 1 1 6 1 6 1 1 8 1 8 6 1 1 6 1 1 8 1 8 1 1
symmnumber: 1
zpe: 2091611.6 jmol-1
zpe.correction: 0.796653 hartree
zpe.thermalcorrener: 0.847237 hartree
zpe.thermalcorrenthalpy: 0.848181 hartree
zpe.thermalcorrgfe: 0.713777 hartree
zpe.sumelectzpe: -4153.349475 hartree
zpe.sumelectthermal: -4153.298891 hartree
zpe.sumelectthermalent: -4153.297946 hartree
zpe.sumelectthermalfe: -4153.432351 hartree
dipole: -0.4120 -5.0850 2.9428
dipole: 5.8895
quadrupole: -312.7671 -336.2225 -355.8224
quadrupole: 8.7844 -1.6317 13.5325
quadrupole: 22.1702 -1.2851 -20.8851 8.7844 -1.6317 13.5325
hfenergy: -4154.1461274 hartree
pointgroup: C01 [X(C44H46Fe1N2O4P2Ru1)]
dipole: -0.162077 -2.0005941 1.1577681 debye
polarizability: 812.5904373|55.0426133|933.4681579|-3.7652455|31.4858563|836.1588547 unknown
InChI: InChI=1/44C.Fe.2N.4O.2P.Ru.46H
charge 0 multiplicity 1
100 atoms
Ru 0.2319653 0.12286364 -0.75171524
C  -0.24853586 -1.56591124 -3.18551633
H  0.53319377 -2.32557413 -2.95856644
N  0.20705722 -0.20936625 -2.96461215
P  1.46289149 -1.57354541 0.02119253
P  1.88293073 1.68795288 -0.54348155
Fe 4.54299857 -0.46029103 -0.75276278
C  4.79057495 -1.72802796 -2.32798556
C  4.74735051 1.47570313 -1.31262549
C  3.41171808 -1.46228834 -2.0819333
C  5.34843733 -2.29021411 -1.14165314
C  5.95446626 1.00963533 -0.71381583
C  3.67485895 1.30853567 -0.36821299
C  3.1039074 -1.85206199 -0.73189704
C  4.31749904 -2.37331091 -0.15898553
C  5.65339899 0.56927164 0.60714807
C  4.25782667 0.75671608 0.82632995
H  5.328933 -1.51209789 -3.25081219
H  4.66356698 1.87035168 -2.32361478
H  2.70315851 -1.0017134 -2.77134136
H  6.39030198 -2.57627678 -0.99610313
H  6.93127738 0.97842011 -1.19631974
H  4.4486097 -2.72185575 0.86520715
H  6.35650824 0.13702569 1.31892632
H  3.72117195 0.50775248 1.74111347
C  1.86435783 -1.66320184 1.83223407
C  2.33683848 -2.85823771 2.39713555
C  1.69166965 -0.5534607 2.66690574
C  2.64298526 -2.93393575 3.75520341
C  1.9983724 -0.62604642 4.02630808
C  2.47516195 -1.81624137 4.57411675
H  2.46131982 -3.74689784 1.77050553
H  1.3122201 0.37935664 2.23972319
H  3.0081581 -3.87389281 4.17682889
H  1.85866079 0.25412205 4.65935337
H  2.71023906 -1.87647385 5.63976018
C  0.69221707 -3.24217113 -0.17975924
C  -0.40800491 -3.57640341 0.62425758
C  1.12488795 -4.16307625 -1.14227663
C  -1.06585951 -4.79340709 0.46224957
C  0.46774416 -5.38475375 -1.30360763
C  -0.63070958 -5.70150845 -0.50542848
H  -0.75130343 -2.87275328 1.39018653
H  1.98752385 -3.92995938 -1.77377859
H  -1.92387677 -5.03485433 1.09546265
H  0.82182162 -6.09368826 -2.05646056
H  -1.14508191 -6.65727968 -0.63278645
C  1.91947543 2.79531131 -2.02411866
C  1.4406314 4.11286971 -1.99514515
C  2.37387665 2.27882486 -3.24780571
C  1.44478726 4.89808048 -3.15026288
C  2.40164428 3.06882199 -4.39429256
C  1.93813238 4.38433185 -4.34850935
H  1.06571962 4.54230921 -1.06123886
H  2.72282555 1.24327341 -3.30204416
H  1.06092233 5.92075049 -3.10724343
H  2.76063271 2.64261305 -5.33360447
H  1.94854891 5.00292746 -5.24956489
C  1.72647289 2.94521069 0.80870899
C  0.51012698 3.09859538 1.48388787
C  2.79343903 3.79578478 1.13683561
C  0.36104094 4.07797116 2.46727127
C  2.64669938 4.77040419 2.12202776
C  1.42915157 4.91383906 2.79025025
H  -0.31932098 2.43031671 1.23351585
H  3.74940322 3.70209461 0.61221274
H  -0.59543944 4.18532165 2.9853109
H  3.48801678 5.42290134 2.36929595
H  1.31496535 5.67782201 3.56345896
C  -3.5023028 -2.9422499 -1.76670793
C  -3.54687592 -2.20483582 -0.58333989
C  -2.50362581 -1.33344401 -0.30537497
N  -1.45929477 -1.16344165 -1.13556662
C  -1.4206704 -1.85060441 -2.29954665
C  -2.43082453 -2.75623811 -2.63217581
H  -4.30004272 -3.6456915 -2.01564298
H  -4.37318296 -2.30518281 0.12194327
H  -2.48213289 -0.74409775 0.61518412
H  -2.36850441 -3.29962631 -3.57742602
H  -0.5520238 -1.78005996 -4.23324392
H  1.07110898 -0.07167469 -3.48782006
C  -2.19542275 1.85764549 -1.80935749
H  -2.81807303 0.94429001 -1.84978659
C  -2.85786368 3.14454007 -2.1522511
H  -3.67551196 3.2714212 -1.4105648
H  -3.36885259 3.02373567 -3.12511114
O  -1.99093399 4.22993195 -2.14327717
H  -1.11249899 3.87618106 -1.92566137
O  -1.62959413 1.17486948 -4.05603418
C  -1.07502368 2.31910405 -4.62241155
H  -0.27978125 2.74486221 -3.97259257
H  -1.83766633 3.11747341 -4.72671892
C  -0.50501078 2.02838657 -5.9966451
H  0.01627263 2.9139251 -6.39665142
H  -1.3405462 1.80748389 -6.69369216
O  0.41995576 0.96454025 -5.97342017
H  0.00483445 0.28342879 -5.4241124
O  -1.06348193 1.86576462 -1.32728329
H  -0.21733471 0.34252407 0.80388398
H  -0.7935122 0.60267811 -3.55251159
