program: Gaussian 16
title: For excited state optimization with solvation, firstTD job
version: ES64L-G16RevC.02
method: RM06L
basis: def2SVP/W06
operation: Freq
keyword: #P
keyword: Geom=AllCheck
keyword: Guess=TCheck
keyword: SCRF=Check
keyword: GenChk
keyword: RM06L/def2SVP/W06
keyword: Freq
title: For excited state optimization with solvation, first TD job
converged: YES YES NO YES
title: Mulliken charges:
elementType: Ru C H N H P P Fe C C C C C C C C C C H H H H H H H H C C C C C C H H H H H C C C C C C H H H H H C C C C C C H H H H H C C C C C C H H H H H C C C N C C H H H H H H H C H H C H H O H O
charge: 0.117985 0.196254 0.080306 -0.307710 0.201632 0.329703 0.430819 -0.221214 0.000126 -0.015252 -0.031162 -0.011118 -0.012317 -0.204504 -0.163649 0.009073 -0.002246 0.012951 0.063748 0.056502 0.042974 0.068330 0.066965 0.060485 0.067170 0.043924 -0.156334 -0.024588 -0.031811 -0.054073 -0.050989 -0.047199 0.048435 0.068059 0.055922 0.054272 0.058729 -0.123016 -0.017008 -0.054890 -0.054700 -0.055292 -0.053900 0.049264 0.044498 0.052290 0.052219 0.055631 -0.105846 0.000695 -0.049551 -0.056704 -0.056396 -0.052437 0.037685 0.018985 0.052502 0.050800 0.056052 -0.158475 -0.019837 -0.037116 -0.040322 -0.047665 -0.050245 0.055078 0.047303 0.050766 0.054953 0.057385 0.018717 -0.083936 0.121029 -0.339545 0.023912 -0.068775 0.073454 0.069239 0.107896 0.057791 0.061970 0.186192 -0.280494 0.229036 -0.016371 -0.030875 0.170678 0.004661 -0.002635 -0.395144 0.193449 -0.603151
chargesum: -0.00000
title: Mulliken charges with hydrogens summed into heavy atoms:
elementType: Ru C N P P Fe C C C C C C C C C C C C C C C C C C C C C C C C C C C C C C C C C C C C C N C C C C O O
charge: -0.162508 0.338530 0.080113 0.329703 0.430819 -0.221214 0.063874 0.041250 0.011812 0.057212 0.054647 -0.204504 -0.163649 0.069558 0.064924 0.056874 -0.156334 0.023847 0.036248 0.001849 0.003283 0.011530 -0.123016 0.032256 -0.010392 -0.002410 -0.003073 0.001731 -0.105846 0.038379 -0.030566 -0.004202 -0.005596 0.003615 -0.158475 0.035241 0.010188 0.010444 0.007288 0.007140 0.092171 -0.014698 0.228925 -0.339545 0.023912 -0.010984 0.181790 0.172704 -0.201695 -0.603151
polarizability: 7.91567366e+02 5.11887073e+01 8.81213733e+02 -7.41302586e+00 4.80799350e+01 7.93086172e+02
1716.lowfreq: -1.6690 0.0032 0.0044 0.0047 3.0949 6.4649 13.4776 23.6240 31.7090
redmass: 5.7947 5.6839 5.6646 5.3054 5.5095 5.2787 4.6844 4.8519 5.2710 4.2258 4.5851 5.3734 4.4719 5.4092 3.6013 4.4905 3.0685 3.2195 3.9023 5.3477 5.2530 5.6170 5.3856 5.2958 3.9914 5.8837 4.7663 4.0908 4.4615 4.0749 4.5441 5.5735 5.2681 5.0595 4.8641 4.3863 3.6796 4.7962 6.0366 5.3471 4.6217 3.5585 1.3151 4.8547 4.8251 4.1868 4.4169 6.1933 4.7666 2.8875 2.8636 3.0301 2.9049 5.9168 5.1640 3.0515 5.9658 6.7830 4.5758 4.9853 6.0774 7.3301 6.5567 3.5186 6.5032 5.8612 6.9353 5.7196 6.0724 5.0271 6.5316 1.6822 6.5299 4.5183 4.7229 6.3394 6.3218 6.3219 6.3395 2.7136 6.8951 6.4962 6.4876 6.4426 5.8857 6.3408 5.7905 1.5779 1.5546 1.5771 1.5936 2.0858 1.7899 2.1946 1.9931 2.1662 1.5442 1.4901 1.1065 1.2877 2.4440 1.5655 2.4067 1.2700 3.1399 1.1783 1.2674 1.3116 1.2486 1.2503 1.3143 1.4351 1.2471 2.2004 1.3589 1.8338 1.3458 1.5225 1.3575 1.4135 1.3531 1.3536 1.3424 1.3864 1.3733 1.3860 1.4062 1.3688 1.2905 5.5656 1.3222 1.4333 5.9124 3.7419 3.5009 1.5002 1.2932 1.4103 4.2449 1.4851 1.3804 1.3078 4.8487 2.5742 1.2959 2.4301 2.0849 1.4101 2.4871 1.4202 2.4264 2.2644 1.5225 1.4827 2.6665 1.5144 1.5156 2.6889 2.8110 2.8285 1.4373 2.8114 1.0732 1.0611 1.0699 1.1153 1.0644 1.8742 2.4478 1.3031 1.1206 1.1789 1.1203 1.1330 2.1280 2.6932 2.2562 2.1659 1.1518 1.1971 1.8737 1.3359 1.1478 1.3735 1.3542 1.2892 1.3503 1.3570 3.5724 1.8332 3.4205 4.4526 6.1969 6.5473 7.6824 7.6854 1.6258 1.1153 4.1011 6.0292 3.9999 5.8281 3.1133 1.5843 3.0968 2.4196 2.3785 2.4203 2.4263 2.4172 1.1028 1.0838 2.2701 2.2897 2.2612 2.2498 3.0297 1.1177 5.9429 6.0087 6.0518 6.1858 6.1988 6.1574 6.2550 6.2951 6.2080 6.3124 1.0174 1.0571 1.0972 1.0576 1.1069 1.0626 1.1033 1.0878 1.0888 1.0877 1.0884 1.0869 1.0842 1.0868 1.0897 1.0891 1.0878 1.0926 1.0954 1.0950 1.0893 1.0921 1.0900 1.0953 1.0940 1.1002 1.1005 1.1003 1.1007 1.0963 1.0888 1.0890 1.1000 1.0939 1.0926 1.0969 1.0989 1.1059 1.1045 1.0658 1.0827 1.0668
irintensity: 0.1281 0.1773 0.2906 0.4786 1.7266 0.3198 0.1432 0.6658 0.1225 1.4316 0.1510 0.4876 1.1179 0.7886 1.9231 1.2861 4.8412 3.3108 2.3818 3.2041 0.7470 6.8870 5.2818 6.0215 1.0776 1.8913 5.2716 2.8416 1.1771 10.4977 3.4867 3.5455 10.5500 3.3391 0.7036 7.9454 37.9205 7.0540 12.4253 2.8110 3.4630 20.3498 94.7358 0.3799 0.1661 3.9653 10.2721 17.7363 45.7109 0.2789 1.0714 0.3106 0.2927 24.3291 19.3207 12.5444 113.4573 64.4167 34.7825 14.8654 66.8053 102.4086 54.2503 13.7654 185.4261 120.9573 8.6143 139.3982 15.1969 19.1871 138.6890 45.8345 32.7997 5.0942 3.9339 0.4469 3.8992 1.0055 3.8774 8.7620 31.5101 47.4849 2.1076 23.8358 17.9015 30.1846 33.2226 52.5384 37.8723 45.7847 51.6161 24.1660 25.0503 4.8070 6.0425 8.8594 36.2830 33.5264 0.3209 59.1405 0.7419 0.5851 13.0519 29.1097 5.5629 4.2080 7.4805 1.1291 0.6901 0.0554 1.5732 1.2952 0.1527 2.5062 2.9341 0.7709 0.8197 0.7091 1.5172 57.0601 2.6294 0.7351 0.1028 8.3135 0.7422 0.4138 3.3656 1.0166 0.1245 2.0833 0.3530 0.0387 2.6613 0.3496 0.4538 0.8566 2.2303 35.7394 92.1459 42.8199 15.5559 11.7167 27.7596 121.1657 35.1795 13.3555 13.0261 1.3873 6.4799 16.6382 14.8655 20.2334 13.1983 6.3938 13.4168 5.3075 3.9325 45.7837 53.7774 19.3467 2.9034 19.2794 2.9151 0.1954 0.1400 23.5153 0.1795 104.4240 272.9019 22.8835 6.5832 41.6116 1.7120 2.2637 24.7259 48.5651 9.6512 21.0675 4.5115 27.2025 1.1213 4.2370 3.7006 8.1483 5.6199 3.4940 2.8287 2.9705 36.3512 46.0249 24.9675 2.7920 2.2219 2.3750 6.4024 4.5306 2.7020 20.8322 1.4038 2.2828 0.0101 0.2237 9.0425 9.4414 3.3884 25.5112 22.1579 11.1852 15.0400 23.8122 30.3512 17.1129 8.7015 8.7904 10.9771 9.3259 34.6265 52.5600 10.4354 0.4221 1.2403 2.8542 4.8736 14.9287 0.1475 0.6091 5.2429 6.8784 452.7785 325.4963 183.5317 129.3442 133.1136 65.1527 22.0117 4.0909 3.2491 5.3264 4.9251 1.9832 0.9559 1.5055 0.5428 0.9557 4.5778 31.9765 36.4674 32.2275 5.7660 11.6924 0.1924 31.6374 2.5490 52.6951 66.0940 33.0941 37.7084 13.8886 1.0437 3.3886 16.2453 1.6526 4.7844 14.4347 6.9954 16.8214 17.7622 85.9231 28.9481 83.6394
temp: 298.150 k
press: 1.00000 atm
elementType: 44 6 1 7 1 15 15 26 6 6 6 6 6 6 6 6 6 6 1 1 1 1 1 1 1 1 6 6 6 6 6 6 1 1 1 1 1 6 6 6 6 6 6 1 1 1 1 1 6 6 6 6 6 6 1 1 1 1 1 6 6 6 6 6 6 1 1 1 1 1 6 6 6 7 6 6 1 1 1 1 1 1 1 6 1 1 6 1 1 8 1 8
symmnumber: 1
zpe: 1933851.3 jmol-1
zpe.correction: 0.736565 hartree
zpe.thermalcorrener: 0.782831 hartree
zpe.thermalcorrenthalpy: 0.783775 hartree
zpe.thermalcorrgfe: 0.656332 hartree
zpe.sumelectzpe: -3924.559045 hartree
zpe.sumelectthermal: -3924.512779 hartree
zpe.sumelectthermalent: -3924.511835 hartree
zpe.sumelectthermalfe: -3924.639278 hartree
dipole: 1.1865 -4.0129 -4.9827
dipole: 6.5068
quadrupole: -303.6041 -308.8576 -293.4954
quadrupole: 8.0856 1.6212 3.0743
quadrupole: -1.6184 -6.8719 8.4903 8.0856 1.6212 3.0743
hfenergy: -3925.2956103 hartree
pointgroup: C01 [X(C42H42Fe1N2O2P2Ru1)]
dipole: 0.4667938 -1.5787886 -1.9603327 debye
polarizability: 791.5673663|51.1887073|881.2137327|-7.4130259|48.079935|793.0861722 unknown
InChI: InChI=1/42C.Fe.2N.2O.2P.Ru.42H
charge 0 multiplicity 1
92 atoms
Ru 0.00268187 0.06808843 -0.2915658
C  -0.99585607 -1.0842584 -2.98850281
H  -0.32257339 -1.94613678 -3.14379087
N  -0.19244568 0.05067082 -2.56232742
H  -0.74946935 0.91618343 -2.53669205
P  1.30131722 -1.71979487 0.15330391
P  1.56857041 1.69676001 -0.07943797
Fe 4.30944868 -0.31182992 -0.42024058
C  4.65448341 -1.34411766 -2.14232092
C  4.48013375 1.69298374 -0.69914825
C  3.25779369 -1.21673268 -1.88381068
C  5.24461057 -2.01203658 -1.02849075
C  5.66017255 1.17651956 -0.08588388
C  3.35681248 1.37304363 0.13864032
C  2.96847128 -1.79999484 -0.60254653
C  4.21435684 -2.29762926 -0.08243158
C  5.28691659 0.55074856 1.13936184
C  3.87404596 0.67255734 1.28248962
H  5.17997914 -0.97542824 -3.0234034
H  4.44560901 2.22525308 -1.64896726
H  2.51884214 -0.74074567 -2.52931434
H  6.30414752 -2.23631496 -0.90278003
H  6.66816235 1.23437127 -0.49690085
H  4.36312078 -2.76335322 0.89176316
H  5.95591242 0.03893408 1.83100976
H  3.27778628 0.27916878 2.10615012
C  1.69533813 -2.2213251 1.89867342
C  2.19911307 -3.50058692 2.18319347
C  1.48464792 -1.33632715 2.96214191
C  2.49493128 -3.87743875 3.49217612
C  1.78320056 -1.70938181 4.27392101
C  2.28879948 -2.98047178 4.54215503
H  2.36019557 -4.21535603 1.36973836
H  1.0771202 -0.34240333 2.75206501
H  2.88531728 -4.8783074 3.69413023
H  1.61358791 -1.0022397 5.08997062
H  2.51767767 -3.27614161 5.56919217
C  0.56450699 -3.30747643 -0.44817768
C  -0.47272659 -3.89983249 0.29041681
C  0.9109529 -3.87411331 -1.68213933
C  -1.14968751 -5.01656044 -0.19481093
C  0.23557007 -4.99563617 -2.16830438
C  -0.79956949 -5.56781811 -1.42927826
H  -0.75284352 -3.47936784 1.2619328
H  1.72038293 -3.43722774 -2.27540781
H  -1.9570165 -5.45943872 0.394956
H  0.52579553 -5.42677525 -3.13018826
H  -1.32867653 -6.44479708 -1.81037483
C  1.5379149 2.76963218 -1.57981887
C  0.81618674 3.97101972 -1.6006925
C  2.09938428 2.30958262 -2.78115586
C  0.67349718 4.69609674 -2.78367953
C  1.96457369 3.03760035 -3.96293341
C  1.24765157 4.23486679 -3.96816002
H  0.35186271 4.34263404 -0.68419316
H  2.64917045 1.36381939 -2.79238276
H  0.10465406 5.62972975 -2.77853229
H  2.42026802 2.66516969 -4.88425702
H  1.13527655 4.80503389 -4.89369473
C  1.32057078 2.95219193 1.25319545
C  0.09567414 3.01968462 1.92671847
C  2.32552105 3.87572905 1.57651929
C  -0.1222038 3.99290679 2.90330255
C  2.10964118 4.84426965 2.55575658
C  0.88339929 4.90582761 3.2205818
H  -0.68422624 2.2977734 1.67085611
H  3.28746579 3.84232749 1.05473471
H  -1.08507342 4.03599461 3.41963022
H  2.90283298 5.55545811 2.8005791
H  0.71398167 5.66547459 3.98808588
C  -4.07059054 -2.5350074 -1.30474407
C  -3.79289043 -2.18250801 0.01500511
C  -2.6251648 -1.48375065 0.28567033
N  -1.74587562 -1.13287625 -0.67056492
C  -2.01006714 -1.46641601 -1.95255352
C  -3.16820608 -2.16684404 -2.29613667
H  -4.98043889 -3.08322201 -1.5584687
H  -4.47098888 -2.43929263 0.8301033
H  -2.36490068 -1.18339219 1.30372029
H  -3.35075626 -2.41356148 -3.34420411
H  -1.50483309 -0.92419908 -3.95514822
H  0.57922719 0.19934147 -3.20972565
H  -0.31381655 0.17609065 1.28796657
C  -2.48673079 1.87599697 -0.23189309
H  -2.54510158 1.59963524 0.85301553
H  -3.25261141 1.21499178 -0.71810743
C  -2.98475872 3.30258238 -0.36182737
H  -2.91366951 3.60549158 -1.42761359
H  -2.29889547 3.97419132 0.19621101
O  -4.30593218 3.38114294 0.12383832
H  -4.59465088 4.29665426 0.04164969
O  -1.23117533 1.76096938 -0.76431111
