program: Gaussian 09
title: 000052776
version: EM64L-G09RevD.01
frameworkgroup: C1[X(C17H16N2O)]
method: RPBEPBE
basis: SDD
operation: Freq
keyword: #p
keyword: freq=noraman
keyword: PBEPBE/SDD
title: #p freq=noraman PBEPBE/SDD
converged: YES YES NO NO
title: Mulliken charges:
elementType: O N N C C C C C C C C C C C C C C C C C H H H H H H H H H H H H H H H H
charge: -0.455442 -0.100290 -0.098987 -0.248408 -0.434720 0.475781 -0.537774 0.365423 -0.421508 0.323152 -0.412440 -0.235502 -0.158452 -0.209337 -0.394546 -0.395429 -0.331542 -0.240012 -0.236430 -0.241190 0.227584 0.216674 0.254571 0.275976 0.246372 0.242689 0.230298 0.273558 0.255157 0.346946 0.246060 0.236947 0.252992 0.226157 0.225838 0.229832
chargesum: 0.00000
title: Mulliken charges with hydrogens summed into heavy atoms:
elementType: O N N C C C C C C C C C C C C C C C C C
charge: -0.108496 -0.100290 -0.098987 -0.020824 0.036525 0.475781 -0.261798 0.365423 -0.175136 0.323152 -0.169751 -0.005204 0.115107 0.045821 -0.148486 -0.158482 -0.078550 -0.013854 -0.010592 -0.011358
polarizability: 2.76836021e+02 1.09055838e+00 1.96034798e+02 -4.00123538e+01 -6.82337328e+00 1.17351216e+02
1716.lowfreq: -8.0944 -2.6989 -0.0005 -0.0003 0.0003 5.7543 13.5084 24.9651 47.0149
frequency: 13.1298 24.9438 47.0121 63.9694 77.5334 94.9624 99.1878 127.5957 190.0608 233.6920 262.2268 275.9321 303.2784 317.1523 338.5734 377.9112 388.9281 407.0004 437.0405 468.2132 516.0761 584.7135 610.9101 616.2835 618.7536 631.2154 653.4848 701.5892 703.2566 709.6071 729.9865 738.0172 766.2750 769.1510 809.4490 832.7005 844.2938 851.7181 879.4016 913.6497 917.0317 931.3645 956.3922 974.8751 983.2898 985.7541 986.9670 992.5357 994.7251 1008.4970 1022.2531 1027.7926 1052.5458 1055.5066 1084.8536 1101.1742 1107.2812 1149.3132 1154.6187 1173.5529 1186.4680 1198.0320 1209.3390 1216.7368 1265.1584 1285.7729 1290.6925 1304.8136 1319.9171 1330.0413 1337.5829 1357.6257 1373.0230 1375.8004 1400.8154 1426.2218 1440.6828 1446.5563 1461.0060 1472.0230 1479.8048 1498.4319 1581.9577 1597.1561 1612.8551 1615.9373 2963.8495 2998.5744 3081.3845 3122.5438 3125.2755 3127.6205 3137.2001 3140.7043 3148.6440 3154.5455 3160.4466 3165.1108 3223.3477 3226.3872 3255.0110 3561.3699
redmass: 6.1896 5.3097 3.7516 4.1894 4.8640 4.7119 4.7204 4.3857 4.7078 4.8731 3.4669 1.2305 4.8849 6.5600 2.5906 3.4268 3.4838 2.8517 5.5000 3.5386 3.1308 4.3321 6.1652 4.2843 5.1208 3.7703 3.4188 2.1751 3.0876 2.0475 1.3165 3.8716 1.7160 1.4493 1.6166 3.4795 1.4168 1.2538 6.2634 1.3674 1.3980 1.5339 2.3576 1.4441 1.6715 4.4725 5.0713 4.2317 1.3220 3.7734 2.8670 3.4311 1.9909 1.6749 1.6161 1.7165 1.7830 1.3339 1.4799 1.0525 1.0943 1.1230 1.3804 1.5955 1.9199 1.4104 1.7458 1.5328 1.3997 2.1918 1.9845 2.8146 3.7168 6.7357 1.7813 2.8335 1.8277 2.4904 1.7764 2.4143 2.5102 2.7046 5.4910 6.2227 6.0046 6.2854 1.0852 1.0633 1.1010 1.0846 1.0867 1.0874 1.0913 1.0919 1.0963 1.0917 1.0986 1.1015 1.0968 1.0917 1.1096 1.0663
irintensity: 0.5501 2.4330 0.0645 2.3257 2.8690 1.2944 3.8195 1.8374 1.4761 1.1440 12.7652 141.8166 5.6850 2.1540 0.1957 3.0159 2.2015 0.1207 2.6553 6.5280 2.6935 15.0258 4.3241 1.1144 4.8417 19.2011 21.1414 19.3656 11.1436 48.6552 12.2624 11.8902 34.5364 134.1116 22.1068 8.2482 2.0664 0.2393 12.2018 1.5212 12.5172 7.0049 4.1576 0.7468 16.2061 20.1361 26.7957 2.9539 0.1349 22.5682 6.5694 2.3492 4.0568 22.4737 7.0229 6.7932 9.3058 65.1880 2.8322 0.1583 1.0469 0.7124 12.8218 20.8393 36.5078 5.6081 0.8199 4.9588 1.4703 2.5046 0.3188 0.1012 0.9506 1.5931 51.0438 12.1162 18.1097 11.8512 16.7549 29.1366 13.9165 1.3319 4.6409 3.8747 3.8766 18.6049 33.0733 40.8303 13.7613 6.5634 1.8973 1.4508 25.6798 7.0964 33.6541 9.0318 18.8131 24.0590 2.8335 1.9609 2.1419 10.1009
temp: 298.150 k
press: 1.00000 atm
elementType: 8 7 7 6 6 6 6 6 6 6 6 6 6 6 6 6 6 6 6 6 1 1 1 1 1 1 1 1 1 1 1 1 1 1 1 1
symmnumber: 1
zpe: 755834.5 jmol-1
zpe.correction: 0.287882 hartree
zpe.thermalcorrener: 0.304890 hartree
zpe.thermalcorrenthalpy: 0.305835 hartree
zpe.thermalcorrgfe: 0.240376 hartree
zpe.sumelectzpe: -840.712003 hartree
zpe.sumelectthermal: -840.694995 hartree
zpe.sumelectthermalent: -840.694050 hartree
zpe.sumelectthermalfe: -840.759509 hartree
dipole: 2.0359 2.4289 -0.5239
dipole: 3.2123
quadrupole: -131.5340 -101.6558 -120.0292
quadrupole: -18.8776 -6.8561 -2.2780
quadrupole: -13.7943 16.0838 -2.2895 -18.8776 -6.8561 -2.2780
hfenergy: -840.9998851 hartree
pointgroup: C01 [X(C17H16N2O1)]
dipole: -0.7737916 0.4163725 0.9083692 debye
polarizability: 274.2257666|33.5652385|141.1164196|-29.4100906|35.0490453|174.879849 unknown
InChI: InChI=1S/C17H16N2O/c20-17(12-19-10-9-18-13-19)16-8-4-7-15(11-16)14-5-2-1-3-6-14/h1-11,13,17,20H,12H2
charge 0 multiplicity 1
36 atoms
O  1.175756 2.217547 2.038649
N  3.458988 -0.437739 0.603021
N  5.222299 -0.962359 -0.731896
C  1.863231 1.50815 0.946479
C  2.638298 0.299405 1.570499
C  0.807152 1.073598 -0.056144
C  -0.490895 0.727494 0.383786
C  -1.478862 0.266664 -0.526124
C  1.135996 0.958564 -1.427891
C  -2.850107 -0.085713 -0.053486
C  -1.128291 0.153858 -1.900653
C  0.165588 0.495859 -2.344376
C  3.068619 -1.547219 -0.161995
C  4.764495 -0.122257 0.217004
C  -3.452346 0.60857 1.032324
C  -3.591639 -1.128417 -0.675435
C  4.163317 -1.856126 -0.972221
C  -4.747603 0.272321 1.480315
C  -4.887728 -1.464598 -0.230056
C  -5.47328 -0.766232 0.851315
H  2.600434 2.172471 0.446894
H  3.306278 0.677948 2.368689
H  1.90773 -0.383897 2.036169
H  -0.724785 0.823247 1.448712
H  2.139997 1.224563 -1.779007
H  -1.8820 -0.167271 -2.628239
H  0.416458 0.415219 -3.40753
H  2.080871 -1.990851 -0.070178
H  5.32917 0.693653 0.664043
H  1.845436 2.626044 2.643872
H  -2.914428 1.43625 1.508283
H  -3.139455 -1.699542 -1.494415
H  4.258551 -2.656757 -1.701688
H  -5.194605 0.827196 2.312883
H  -5.436625 -2.276968 -0.719684
H  -6.479317 -1.026773 1.198281
