program: Gaussian 16
title: For excited state optimization with solvation, first TDjob
version: ES64L-G16RevC.02
method: RM06L
basis: def2SVP/W06
operation: Freq
keyword: #P
keyword: Geom=AllCheck
keyword: Guess=TCheck
keyword: SCRF=Check
keyword: GenChk
keyword: RM06L/def2SVP/W06
keyword: Freq
title: For excited state optimization with solvation, first TD job
converged: YES YES NO YES
title: Mulliken charges:
elementType: Ru H C H N H P P Fe C C C C C C C C C C H H H H H H H H C C C C C C H H H H H C C C C C C H H H H H C C C C C C H H H H H C C C C C C H H H H H C C C N C C H H H H H
charge: 0.381308 -0.329782 0.221889 0.016474 -0.563211 0.119222 0.347734 0.363737 -0.235812 0.005604 -0.005344 -0.026558 -0.015211 -0.013865 -0.188197 -0.203125 0.009920 -0.007504 -0.003431 0.062331 0.056557 0.079630 0.066289 0.066614 0.058164 0.066159 0.046521 -0.133302 -0.025587 -0.001520 -0.051980 -0.042213 -0.046672 0.051170 0.006704 0.057918 0.050091 0.060287 -0.142112 -0.012664 -0.042360 -0.057144 -0.047699 -0.049419 0.057078 0.055129 0.054495 0.054962 0.057538 -0.146724 -0.035842 -0.019167 -0.051025 -0.056086 -0.048834 0.047223 0.039275 0.055706 0.054234 0.057810 -0.175164 -0.024322 -0.024930 -0.053280 -0.046591 -0.048401 0.052089 0.055003 0.055447 0.057508 0.059728 0.023558 -0.105503 0.137169 -0.351751 0.035752 -0.082235 0.072173 0.067989 0.087773 0.055537 0.027064
chargesum: -0.00000
title: Mulliken charges with hydrogens summed into heavy atoms:
elementType: Ru C N P P Fe C C C C C C C C C C C C C C C C C C C C C C C C C C C C C C C C C C C C C N C C
charge: 0.051526 0.265427 -0.443989 0.347734 0.363737 -0.235812 0.067935 0.051213 0.053072 0.051078 0.052749 -0.188197 -0.203125 0.068083 0.058655 0.043090 -0.133302 0.025583 0.005185 0.005938 0.007878 0.013615 -0.142112 0.044414 0.012769 -0.002649 0.007263 0.008120 -0.146724 0.011381 0.020108 0.004681 -0.001852 0.008977 -0.175164 0.027767 0.030073 0.002167 0.010918 0.011326 0.095731 -0.037514 0.224942 -0.351751 0.035752 -0.026699
polarizability: 7.29678558e+02 9.65490370e+01 8.47894433e+02 5.78503881e-01 6.63607282e+01 7.75927886e+02
1716.lowfreq: -5.0427 0.0038 0.0039 0.0044 9.8382 13.2442 18.7640 29.5685 34.6199
frequency: 15.9478 28.9986 34.1302 39.5209 44.3258 49.8377 50.4213 57.0800 65.6746 72.7431 74.6343 82.4492 86.8414 92.6330 103.0983 104.6864 119.3559 121.1133 147.1693 156.3077 173.7566 177.0508 202.1444 206.1569 210.0451 217.9982 220.1059 225.5579 237.1160 239.5560 248.7167 253.4440 256.9161 264.1371 271.1678 275.7940 282.7381 301.0632 364.1330 402.6244 409.7291 411.2268 416.2977 417.4392 419.1012 427.9585 431.6660 444.9191 454.3451 462.0486 466.3729 468.8404 473.7856 476.6797 485.2722 498.9281 503.4416 510.3384 519.8745 527.3668 529.6770 537.6986 564.7717 589.7676 598.7133 625.3398 625.9286 626.1552 627.8813 641.4919 644.4872 652.1073 654.9636 696.6100 702.8289 704.0000 708.8959 714.5173 715.6210 716.8575 719.7434 723.1246 743.3873 759.2112 761.0781 762.4165 766.1086 768.3796 768.8891 821.1241 822.6129 828.9325 832.0418 840.3386 843.2833 854.7932 858.0751 861.8724 864.7274 865.5548 870.2862 883.5505 889.8208 891.5006 894.7919 896.3595 927.9814 937.0226 939.8475 940.5963 947.7386 953.7562 977.6894 988.9901 995.5214 995.9057 1001.8529 1010.4850 1010.8972 1011.7782 1012.6271 1014.0772 1014.1949 1014.8529 1016.6948 1019.1865 1035.9029 1037.0905 1040.9998 1046.2334 1050.9504 1051.4068 1051.5393 1051.9861 1052.6719 1055.0318 1062.7337 1072.4072 1089.9046 1095.0381 1097.1337 1098.4543 1103.1057 1110.8131 1115.3548 1116.0733 1116.9606 1120.2732 1145.8447 1151.5361 1152.7187 1153.7061 1155.9117 1178.2559 1180.1991 1181.7463 1182.1762 1192.0064 1192.3791 1197.2467 1204.6030 1212.4505 1232.7629 1282.0602 1306.1716 1309.9709 1314.0492 1319.8573 1329.3162 1342.1517 1355.3798 1360.8532 1373.6050 1393.3315 1394.8685 1396.3973 1398.1765 1402.0702 1424.0608 1428.3419 1432.0025 1434.2110 1449.5843 1451.7511 1459.0212 1460.5022 1461.6404 1463.1313 1463.2861 1498.3502 1504.8013 1507.1394 1508.3326 1508.9349 1624.7314 1634.2973 1637.1728 1638.1636 1639.8719 1653.3130 1653.8929 1654.4722 1655.1337 1661.9380 1811.3612 2901.7114 2987.2223 3080.4757 3152.8980 3155.4952 3162.4096 3167.3414 3167.5048 3168.2482 3172.1723 3174.9846 3175.2817 3175.2997 3178.3307 3180.8758 3181.1672 3183.3300 3183.5332 3185.2245 3187.1440 3191.4062 3191.9955 3194.2099 3194.6119 3194.7025 3195.2119 3209.4907 3210.2010 3210.9271 3218.1294 3221.8439 3229.1874 3231.0298 3237.6425 3465.3956
redmass: 4.8142 5.2736 4.6919 4.6986 5.1344 5.2101 4.8387 5.3677 4.9230 5.2725 5.6349 4.5693 4.4195 4.6612 5.1212 4.1710 6.0351 6.2437 6.1176 4.3796 6.1976 4.6294 4.7093 4.7106 5.1752 5.1217 4.4730 5.0544 4.9665 4.8842 4.6685 4.9548 4.9192 4.6680 5.0092 4.5300 5.1966 5.7892 6.5552 2.9927 2.9098 2.9014 2.9637 6.1613 3.0894 5.1630 3.0558 4.4210 6.4220 2.4935 3.4354 5.1329 3.6235 6.4068 5.8746 2.9433 7.1791 6.0452 6.7877 5.2314 5.9407 6.0937 7.4528 4.5191 4.8485 6.3328 6.2785 6.3566 6.2976 4.7968 6.8831 7.0761 6.6181 5.9973 4.0598 6.1399 4.8529 1.5958 1.5062 1.5256 1.5675 1.4466 1.7187 2.0371 1.9211 1.8157 2.0852 1.5601 1.7418 1.5110 2.6492 1.2204 3.4555 3.6813 1.1980 1.3678 1.3022 1.3315 1.2611 1.2460 1.2413 2.3549 1.7647 1.3385 1.9772 1.3705 1.3735 1.3477 1.3585 1.6611 1.3437 1.1636 1.4226 1.4234 1.3710 1.3993 1.3781 2.2007 1.3272 5.8949 5.0411 2.0100 1.2872 5.4002 1.3247 1.3085 6.8608 1.3186 1.3124 1.4800 2.3804 2.0815 1.4514 2.1360 1.7077 2.2587 1.2374 2.0390 1.5638 1.5173 1.4835 3.6668 1.5464 2.4801 2.4578 1.6557 2.6998 2.8545 1.0725 1.0689 1.0608 1.0723 1.0589 1.1222 1.1167 1.1201 1.1581 2.8603 1.3231 4.7094 1.5814 1.4411 2.0681 1.5229 1.3671 1.3572 1.3338 1.3729 1.8760 1.4074 4.4507 4.3986 2.5575 1.1180 5.8800 6.7588 7.3534 7.6121 4.7829 4.7755 4.5289 4.7362 2.9413 2.9758 2.5052 2.4346 2.4490 2.4407 2.4401 2.8062 2.2903 2.2725 2.2869 2.1877 6.7822 5.9238 6.1286 6.1732 6.1735 6.1244 6.2216 6.2908 6.3063 6.3771 1.0185 1.0667 1.0937 1.1047 1.0898 1.0890 1.0877 1.0870 1.0863 1.0851 1.0871 1.0885 1.0900 1.0896 1.0873 1.0933 1.0929 1.0954 1.0953 1.0909 1.0953 1.0930 1.0970 1.1006 1.1006 1.1007 1.0992 1.0900 1.0994 1.0893 1.0941 1.0967 1.1002 1.1034 1.1025 1.0742
irintensity: 0.4358 0.0432 0.1885 1.1149 0.3589 0.1759 0.5187 0.7020 1.3857 0.6340 1.4497 0.1210 0.5620 0.5788 1.4148 0.0302 1.9995 0.4063 2.2442 0.5773 4.0321 1.5099 0.8431 3.1727 1.2752 1.6920 26.4452 2.4885 0.6082 2.8820 1.9235 2.3776 0.6262 4.4994 4.4361 0.2213 3.3680 9.2839 17.2229 27.9719 4.1104 0.6979 1.0512 30.0739 11.5348 15.0529 28.6201 79.8463 42.5359 35.7139 6.4920 60.2284 45.1156 160.3587 26.4877 15.0572 107.0935 254.3286 7.4767 42.4198 58.5859 67.9276 161.0427 3.5741 9.5817 2.2523 2.8164 1.1654 1.6000 10.7147 34.9307 36.8630 3.7116 35.1012 20.7872 15.0963 27.6188 43.9989 35.7323 91.2938 45.6002 69.9688 36.9989 7.9964 25.1803 20.0733 5.7939 14.0654 33.3618 0.3614 2.2462 34.6157 1.0066 3.3170 2.3133 2.6199 2.8942 1.9205 0.2255 0.5949 0.1185 5.7825 3.2115 1.1469 0.1661 0.4371 1.5654 0.5445 0.4680 3.6206 0.1710 8.2878 2.4745 3.7993 0.3134 0.7647 0.3832 0.7712 0.6381 2.6364 1.5219 2.4866 0.1912 3.0101 0.6043 0.9810 2.3050 4.9373 3.8907 8.8092 4.3785 8.3662 1.0545 9.9899 40.8491 10.7852 60.9203 21.5910 10.2561 28.7506 1.4987 88.4125 3.4220 41.7389 23.1220 6.6055 55.8106 32.8800 4.8293 0.2020 0.1235 0.2679 0.3282 6.7696 5.3413 1.5950 19.1120 29.8620 15.4662 39.6071 7.3243 7.2854 1.1835 14.6041 5.1360 8.3839 2.3147 4.3321 14.5308 15.6574 29.4647 3.8492 50.3623 9.0388 2.2431 1.2827 5.0904 4.2321 1.9245 1.5051 0.3889 1.0228 5.4627 2.0987 15.0691 42.9166 16.8445 14.2929 24.6996 47.8989 7.4597 7.2113 4.0079 11.0927 9.8156 1.9391 0.8226 3.4781 2.5177 4.6703 2.2574 2.8111 0.0667 22.3008 641.8132 147.7778 133.6402 200.6622 5.6858 2.7705 4.9041 0.7243 2.3421 1.2398 1.1493 9.3057 0.5412 0.2132 4.4773 4.4490 30.8653 28.9841 35.2189 3.3668 24.8798 2.0797 26.3189 39.0668 59.2543 52.2931 41.6515 2.2735 19.9822 1.5119 2.3376 11.2136 11.5416 17.5404 12.4650 8.0068
temp: 298.150 k
press: 1.00000 atm
elementType: 44 1 6 1 7 1 15 15 26 6 6 6 6 6 6 6 6 6 6 1 1 1 1 1 1 1 1 6 6 6 6 6 6 1 1 1 1 1 6 6 6 6 6 6 1 1 1 1 1 6 6 6 6 6 6 1 1 1 1 1 6 6 6 6 6 6 1 1 1 1 1 6 6 6 7 6 6 1 1 1 1 1
symmnumber: 1
zpe: 1701716.5 jmol-1
zpe.correction: 0.648150 hartree
zpe.thermalcorrener: 0.688141 hartree
zpe.thermalcorrenthalpy: 0.689085 hartree
zpe.thermalcorrgfe: 0.576327 hartree
zpe.sumelectzpe: -3694.532602 hartree
zpe.sumelectthermal: -3694.492610 hartree
zpe.sumelectthermalent: -3694.491666 hartree
zpe.sumelectthermalfe: -3694.604425 hartree
dipole: -1.6561 -1.9865 -0.0556
dipole: 2.5869
quadrupole: -273.8490 -283.1758 -282.5411
quadrupole: 6.5813 6.8976 4.8965
quadrupole: 6.0063 -3.3205 -2.6858 6.5813 6.8976 4.8965
hfenergy: -3695.1807514 hartree
pointgroup: C01 [X(C40H36Fe1N2P2Ru1)]
dipole: -0.6515781 -0.7815573 -0.021874 debye
polarizability: 729.6785578|96.549037|847.8944327|0.5785039|66.3607282|775.9278858 unknown
InChI: InChI=1/40C.Fe.2N.2P.Ru.36H
charge 0 multiplicity 1
82 atoms
Ru -0.00298758 0.20894683 -0.60780021
H  -0.60762595 0.34354912 0.93229582
C  -0.48890283 -1.04168836 -3.25529614
H  0.14554402 -1.95621888 -3.17230376
N  0.25305063 0.0893836 -2.7683028
H  -0.16986076 0.93725077 -3.1584148
P  1.11588221 -1.53166299 0.11187686
P  1.68423003 1.68655082 -0.2101767
Fe 4.20688066 -0.55586944 -0.81228681
C  4.26871638 -1.77214931 -2.44282764
C  4.41680016 1.39087059 -1.32612268
C  2.92759971 -1.4291957 -2.10068021
C  4.86979199 -2.41289946 -1.31780424
C  5.66815493 0.85833325 -0.89363761
C  3.46421424 1.22961294 -0.26372635
C  2.69040861 -1.85884557 -0.74740639
C  3.90305364 -2.47259057 -0.27016538
C  5.5092451 0.3740692 0.43783923
C  4.15668356 0.60004808 0.8307481
H  4.76360652 -1.5483431 -3.38822705
H  4.21923576 1.82163513 -2.30686551
H  2.19531643 -0.86508795 -2.69507714
H  5.89924263 -2.76629833 -1.25308472
H  6.57907045 0.81210836 -1.49049614
H  4.07654264 -2.87019451 0.72974981
H  6.27590337 -0.11013104 1.04270307
H  3.71824877 0.33346756 1.79332529
C  1.58720523 -1.74637518 1.88824194
C  2.02540352 -2.98978997 2.36937111
C  1.50741365 -0.67170242 2.77837766
C  2.39558537 -3.1418721 3.70496418
C  1.88195774 -0.81949153 4.11410003
C  2.32907971 -2.05547462 4.57967098
H  2.07270341 -3.85188317 1.69650571
H  1.14136791 0.29069283 2.41222792
H  2.73310217 -4.11662632 4.06630885
H  1.81675629 0.03573974 4.7924611
H  2.61803855 -2.17719183 5.62664182
C  0.19521385 -3.10258205 -0.16924397
C  -0.89162572 -3.40499992 0.66502031
C  0.48945718 -3.96255141 -1.23506867
C  -1.66860497 -4.53768521 0.43597262
C  -0.29107228 -5.09746417 -1.46506631
C  -1.37224114 -5.3859405 -0.63346882
H  -1.13328976 -2.74013355 1.50132507
H  1.33831688 -3.75037325 -1.89172136
H  -2.51335728 -4.75907878 1.09361044
H  -0.04782278 -5.76069762 -2.29912262
H  -1.9826223 -6.27409109 -0.81501479
C  1.60425153 3.04086308 -1.46932307
C  1.23108195 4.3552433 -1.14892411
C  1.84021209 2.72160119 -2.81858586
C  1.11928352 5.32702841 -2.14464247
C  1.73875596 3.69719132 -3.80814262
C  1.38012617 5.00472646 -3.47527013
H  1.02490925 4.6342365 -0.11244975
H  2.065589 1.68858279 -3.09565024
H  0.82903171 6.34522902 -1.87291599
H  1.93373593 3.43070198 -4.85033616
H  1.29793454 5.76826615 -4.25285197
C  1.70751725 2.69981193 1.34730519
C  0.55676254 2.80166957 2.13699091
C  2.8462433 3.42893946 1.72312782
C  0.54295916 3.59989424 3.28163528
C  2.83559048 4.22442881 2.86769005
C  1.68423742 4.30984041 3.65248527
H  -0.33232017 2.22995762 1.85161305
H  3.75235306 3.38390611 1.1116614
H  -0.36440626 3.66297933 3.88787348
H  3.73287933 4.78203065 3.14818102
H  1.67797375 4.9307321 4.55192759
C  -3.9392664 -2.31589581 -2.21997778
C  -3.9629597 -1.81354705 -0.91860316
C  -2.85513771 -1.11774225 -0.45617664
N  -1.76850968 -0.89423102 -1.21671416
C  -1.74255587 -1.35732536 -2.48778076
C  -2.81653961 -2.08624042 -3.00626777
H  -4.79064868 -2.87455527 -2.61647743
H  -4.82303424 -1.96207436 -0.26398949
H  -2.81648127 -0.72160755 0.56154604
H  -2.7604315 -2.45891981 -4.03187484
H  -0.74401296 -0.99139224 -4.33396613
