program: Gaussian 16
title: For excited state optimization with solvation, first TDjob
version: ES64L-G16RevC.02
method: RM06L
basis: def2SVP/W06
operation: Freq
keyword: #P
keyword: Geom=AllCheck
keyword: Guess=TCheck
keyword: SCRF=Check
keyword: GenChk
keyword: RM06L/def2SVP/W06
keyword: Freq
title: For excited state optimization with solvation, first TD job
converged: YES YES YES YES
title: Mulliken charges:
elementType: Ru H C H N H P P Fe C C C C C C C C C C H H H H H H H H C C C C C C H H H H H C C C C C C H H H H H C C C C C C H H H H H C C C C C C H H H H H C C C N C C H H H H H
charge: 0.229951 -0.247749 0.225293 0.052589 -0.588568 0.157836 0.355805 0.404943 -0.234536 -0.003890 0.010742 0.001496 -0.012819 -0.014502 -0.202014 -0.181165 -0.012202 -0.005544 -0.013570 0.066177 0.059341 0.047519 0.066605 0.067779 0.056607 0.066014 0.066315 -0.132803 -0.046224 -0.031100 -0.046297 -0.050030 -0.055148 0.052272 0.039600 0.055627 0.055752 0.058534 -0.152343 -0.035149 -0.036131 -0.043481 -0.047253 -0.048328 0.038864 0.048571 0.050773 0.057276 0.058851 -0.162146 -0.014077 -0.029777 -0.041344 -0.053599 -0.045293 0.028975 0.052718 0.052731 0.058680 0.060828 -0.106493 -0.050133 -0.046528 -0.047271 -0.048006 -0.056129 0.046108 0.048987 0.054643 0.054863 0.057149 0.013208 -0.091657 0.140890 -0.359274 0.020914 -0.073960 0.071887 0.064130 0.075531 0.057473 0.055688
chargesum: -0.00000
title: Mulliken charges with hydrogens summed into heavy atoms:
elementType: Ru C N P P Fe C C C C C C C C C C C C C C C C C C C C C C C C C C C C C C C C C C C C C N C C
charge: -0.017798 0.333569 -0.430732 0.355805 0.404943 -0.234536 0.062287 0.070082 0.049015 0.053786 0.053277 -0.202014 -0.181165 0.044405 0.060470 0.052745 -0.132803 0.006048 0.008500 0.009330 0.005722 0.003385 -0.152343 0.003715 0.012440 0.007292 0.010023 0.010523 -0.162146 0.014899 0.022941 0.011387 0.005081 0.015535 -0.106493 -0.004025 0.002458 0.007373 0.006857 0.001020 0.085096 -0.027526 0.216421 -0.359274 0.020914 -0.016488
polarizability: 7.61097397e+02 2.90529662e+01 8.56591443e+02 3.63020072e+01 -2.13636462e+01 7.61675836e+02
1716.lowfreq: -7.5622 -0.0034 -0.0033 0.0019 1.4416 7.5078 17.4424 27.7793 30.5026
frequency: 16.1506 27.6665 30.2754 36.0359 42.3081 44.4581 46.6529 54.4658 59.0938 60.2899 62.4305 69.6893 77.2579 82.9971 89.3432 96.6565 115.0213 130.8728 141.5623 151.4548 168.8407 174.4362 180.2209 197.6242 203.7769 206.9602 219.4929 222.9047 234.6762 239.3652 245.4447 251.5114 257.7725 260.7055 261.0088 279.6427 282.6253 307.4359 364.5952 405.3898 407.2085 412.3277 413.0024 415.2190 425.1931 437.0772 444.7197 448.2627 457.2280 460.5086 468.9630 472.7071 480.7858 486.2072 502.8010 507.8765 514.4232 523.8659 525.5329 530.8044 536.2502 560.5740 576.3326 588.5688 596.5403 614.1114 625.9321 626.7283 626.9448 627.3941 643.8894 650.2262 653.8360 676.2647 696.4122 699.7270 706.4328 709.2929 716.2615 716.8603 717.2686 719.7784 734.9698 758.3873 763.0429 764.2114 765.4205 766.2883 818.3985 821.9755 827.5730 830.3907 834.0281 840.3401 844.8890 857.0639 858.4934 860.7897 866.4954 867.3168 870.7626 889.2052 892.1127 893.1937 894.9789 895.7621 922.7601 929.5739 929.8027 940.4807 946.4577 962.6201 985.3974 991.1199 991.3371 997.1541 1001.2199 1007.4485 1011.6803 1011.8146 1011.9044 1013.0312 1013.1229 1013.8254 1017.8273 1019.5473 1025.2305 1030.6943 1036.0679 1039.0124 1045.6536 1049.4702 1050.1111 1051.4433 1051.7908 1052.6591 1053.2312 1075.1365 1092.1004 1093.7583 1096.8076 1101.0204 1111.3144 1114.3921 1115.3265 1116.1965 1119.3124 1120.0693 1147.4706 1151.8108 1153.9166 1154.0865 1154.5657 1176.7532 1178.9842 1182.2238 1186.3336 1190.6911 1191.9956 1192.6835 1197.8885 1201.0697 1206.6682 1267.2144 1298.5495 1307.7731 1308.4261 1311.8014 1315.9737 1358.6487 1362.6084 1367.4212 1394.1434 1394.2508 1399.1625 1401.1720 1410.0612 1420.6827 1425.4548 1427.5674 1433.2086 1434.2313 1446.8124 1450.4627 1459.2820 1461.1689 1463.1418 1463.8039 1465.1357 1504.5588 1505.0010 1506.3785 1508.6591 1513.7656 1619.9212 1633.7867 1635.7250 1638.7097 1639.8619 1650.8184 1653.8264 1654.3327 1654.5740 1670.1641 1897.5830 2921.0911 2958.9320 3134.1609 3143.7259 3156.8199 3158.4284 3162.3911 3163.0768 3169.1435 3170.6053 3171.6451 3173.9971 3177.1891 3179.2814 3180.5699 3182.1458 3183.3109 3184.0947 3184.9471 3192.8238 3193.9643 3194.1983 3195.2408 3195.8382 3199.9865 3206.9893 3208.6193 3210.9536 3214.7276 3215.1461 3225.3745 3226.7647 3232.5667 3234.1613 3556.7861
redmass: 6.0104 5.4955 4.7998 4.9894 5.2947 4.7641 4.3930 5.2547 4.5023 4.5062 4.5066 4.9081 4.3298 4.6471 4.9791 5.1626 6.8650 6.3062 6.0815 4.3741 4.8591 4.6314 4.9046 4.5456 4.9556 5.5440 4.7819 3.7378 5.1233 4.5840 5.1783 5.3328 5.5365 4.9006 4.7156 5.2037 4.6861 7.9266 6.2371 2.8639 2.8693 2.9445 2.9470 5.6090 5.2017 3.5225 5.3955 6.6634 5.1749 4.6215 6.2725 4.9553 5.3819 3.0551 6.1259 5.7054 6.4368 5.5318 5.9519 5.5616 5.9228 3.8775 1.4812 4.4396 4.4380 1.4317 6.3390 5.8775 6.1004 5.7294 5.4922 6.4885 6.3565 4.1821 6.3891 6.3694 5.5793 5.9172 1.5756 1.5174 1.5721 1.6217 2.2951 2.1915 2.2362 2.1969 2.1734 1.5034 1.2965 3.6177 1.2330 3.5281 3.6160 1.1889 1.2934 1.3320 1.2527 1.2752 1.3452 1.2712 1.2474 2.8921 1.2814 1.2900 2.1342 1.4608 1.0874 1.3579 1.3604 1.3582 1.3498 1.6687 1.6230 1.3822 1.3768 1.3953 1.4185 1.3093 5.1335 1.3390 5.1291 1.4263 4.1266 3.7714 1.3420 1.4200 1.2769 1.2966 7.2953 1.3867 1.2850 1.2657 2.4128 2.1089 1.6013 2.4482 2.5764 1.9990 1.4706 1.4875 1.4968 1.5064 2.7444 2.7519 1.8918 2.0477 2.8194 2.4679 1.0740 1.0646 1.0612 1.0671 1.0597 1.1184 1.1183 1.1160 1.1222 1.1323 1.6888 3.3954 2.8284 1.9637 1.4102 2.1730 1.4811 1.3597 1.3591 1.3409 1.3498 4.6088 4.6350 6.5243 6.2654 6.6368 7.5604 7.7586 1.5080 1.1791 4.3079 5.4082 4.5055 5.3649 3.1121 3.0455 2.4260 2.4234 2.4421 2.4000 2.4547 2.2539 2.2969 2.2916 2.2450 3.0715 6.6760 6.0530 6.0348 6.2020 6.2591 6.1918 6.2447 6.2655 6.2419 6.4004 1.0184 1.0644 1.0969 1.0902 1.0898 1.0886 1.0884 1.0883 1.0869 1.0866 1.0859 1.0880 1.0884 1.0908 1.0905 1.0945 1.0876 1.0948 1.0961 1.0956 1.1003 1.0927 1.1004 1.1008 1.1005 1.0942 1.0906 1.0899 1.1006 1.0929 1.0933 1.0976 1.0980 1.1060 1.1048 1.0759
irintensity: 0.0010 0.6876 0.5154 0.2995 0.9684 0.1897 0.2071 0.4494 0.2575 0.2471 0.8790 0.2781 0.9000 0.2796 0.7271 0.6575 0.6268 5.4510 0.4120 4.0636 0.1717 4.7642 1.8331 1.1254 4.0894 4.0712 1.3685 5.5637 2.3680 2.1873 0.2771 2.6251 5.2636 1.9272 3.2432 0.8017 1.5105 1.8807 15.0230 0.1417 0.1573 0.6156 3.2159 11.1856 9.6816 24.6364 103.9243 45.4176 97.6099 14.0322 135.0416 10.8582 63.9284 23.5686 155.4895 200.7179 19.1830 68.9308 112.6799 26.8786 26.1067 112.8785 112.3044 7.9391 6.5866 72.9604 2.7271 1.7552 0.2633 12.5229 15.3841 46.1924 4.4435 5.4965 30.5881 14.3764 36.1472 22.0021 23.0536 21.2863 96.6792 41.1426 28.0935 3.0520 6.5509 1.8108 5.0593 45.7718 1.3642 0.2518 32.6823 0.9786 5.8913 3.4261 10.7520 1.3323 0.3710 0.4306 0.4362 0.2869 0.2556 5.3861 0.2727 0.4796 2.2379 1.1559 38.8256 0.5919 0.4374 0.2456 0.2984 2.7486 2.4974 0.5370 0.1725 0.3784 0.6919 0.3639 2.1302 0.3088 0.8878 0.3513 1.6627 1.0049 0.4388 1.4332 12.8981 17.3698 3.3261 7.1307 42.0000 2.0788 8.6126 7.7907 17.1724 9.3016 8.5505 15.4497 0.8043 18.6098 1.1498 4.9663 38.1388 36.7890 31.5154 38.3004 28.2591 28.7873 4.5564 0.3803 0.1834 0.2218 0.0143 5.1120 9.9678 1.5238 2.0853 8.1252 14.9572 35.1837 31.5749 15.3421 53.4757 18.5746 18.5268 5.2088 9.4915 3.2801 2.6883 15.9030 2.6214 16.8798 1.5856 2.8042 7.1273 7.6294 10.0996 12.8400 1.1346 1.9551 0.3130 0.6707 6.7528 2.7116 17.6082 27.1917 21.9408 33.5150 17.5391 12.8906 3.7114 7.0211 11.9830 68.0564 14.1083 1.1611 1.9969 4.7004 3.7141 8.9923 3.8326 11.2548 4.5443 11.8707 412.7421 207.7237 52.6292 19.9181 4.0930 7.0257 3.0423 6.1716 4.3496 1.0256 1.1204 0.6279 0.0510 1.0093 3.0190 32.4675 1.8760 30.5207 39.7229 31.9690 49.6499 15.3711 46.5861 45.6726 38.8137 3.6585 0.7932 0.3157 16.2197 2.4445 1.7380 8.4977 7.3601 19.6469 14.7872 7.6305
temp: 298.150 k
press: 1.00000 atm
elementType: 44 1 6 1 7 1 15 15 26 6 6 6 6 6 6 6 6 6 6 1 1 1 1 1 1 1 1 6 6 6 6 6 6 1 1 1 1 1 6 6 6 6 6 6 1 1 1 1 1 6 6 6 6 6 6 1 1 1 1 1 6 6 6 6 6 6 1 1 1 1 1 6 6 6 7 6 6 1 1 1 1 1
symmnumber: 1
zpe: 1702627.7 jmol-1
zpe.correction: 0.648497 hartree
zpe.thermalcorrener: 0.688732 hartree
zpe.thermalcorrenthalpy: 0.689676 hartree
zpe.thermalcorrgfe: 0.575198 hartree
zpe.sumelectzpe: -3694.553873 hartree
zpe.sumelectthermal: -3694.513638 hartree
zpe.sumelectthermalent: -3694.512693 hartree
zpe.sumelectthermalfe: -3694.627171 hartree
dipole: -1.4419 -2.0982 -1.6510
dipole: 3.0344
quadrupole: -268.2957 -285.8835 -279.8269
quadrupole: 5.9282 0.2904 -11.2769
quadrupole: 9.7063 -7.8815 -1.8249 5.9282 0.2904 -11.2769
hfenergy: -3695.2023694 hartree
pointgroup: C01 [X(C40H36Fe1N2P2Ru1)]
dipole: -0.5672978 -0.8255084 -0.6495661 debye
polarizability: 761.0973972|29.0529662|856.5914425|36.3020072|-21.3636462|761.6758355 unknown
InChI: InChI=1/40C.Fe.2N.2P.Ru.36H
charge 0 multiplicity 1
82 atoms
Ru 0.18294059 0.13361839 0.39812328
H  0.92834932 0.07912557 1.85600557
C  -2.64938382 0.49791586 -0.52745566
H  -3.05739666 0.09294341 -1.48156049
N  -1.30671227 0.98052124 -0.64853362
H  -1.26453893 1.74406904 -1.32111103
P  1.46264656 -1.67380894 0.10341528
P  1.70303162 1.65766294 -0.24302143
Fe 4.53151916 -0.11513106 0.10684513
C  5.23520666 -1.24915523 -1.42397172
C  4.6489012 1.84109041 -0.36501489
C  3.81529726 -1.12530261 -1.47844489
C  5.57798984 -1.83765546 -0.17103257
C  5.74822909 1.47615881 0.4678033
C  3.42902344 1.54249008 0.33805976
C  3.26546847 -1.63689721 -0.25156167
C  4.3710131 -2.08441406 0.54950536
C  5.2273827 0.95784304 1.69032603
C  3.80394913 0.99693584 1.61617276
H  5.9339803 -0.92186634 -2.19379297
H  4.72687079 2.22704256 -1.38121087
H  3.24034167 -0.69844949 -2.30194157
H  6.5865582 -2.04421093 0.1873489
H  6.80205958 1.55142989 0.19917502
H  4.30735939 -2.51962343 1.54653944
H  5.81253715 0.57008558 2.52414799
H  3.10431951 0.6392269 2.37311666
C  1.40900864 -2.96127363 1.43122845
C  0.72988461 -4.17928093 1.29582677
C  1.9377752 -2.6283742 2.6898295
C  0.59446054 -5.04540164 2.38360485
C  1.81925506 -3.4991888 3.76970997
C  1.14090013 -4.71196356 3.62104681
H  0.28215122 -4.45640818 0.3376885
H  2.4328306 -1.66126721 2.82730155
H  0.0528838 -5.9867709 2.25878651
H  2.24576904 -3.22412544 4.73778242
H  1.0345632 -5.39023681 4.47127006
C  0.92898232 -2.65789464 -1.37961623
C  -0.24686851 -2.31379234 -2.05472437
C  1.68759391 -3.73971446 -1.85246746
C  -0.66337744 -3.0350781 -3.17536109
C  1.27428737 -4.46025908 -2.97133889
C  0.09626872 -4.10972046 -3.63536207
H  -0.82098897 -1.44784901 -1.70231112
H  2.61121689 -4.0247569 -1.33762503
H  -1.58326631 -2.75131227 -3.69347637
H  1.87600985 -5.29953656 -3.3296758
H  -0.22470303 -4.67353832 -4.51497134
C  1.909831 2.00096322 -2.0461952
C  1.36818151 1.09693104 -2.96758698
C  2.55780899 3.14920671 -2.52693268
C  1.48882836 1.31801322 -4.34031986
C  2.67858045 3.37264235 -3.89734527
C  2.14654506 2.45551546 -4.8067732
H  0.84221428 0.21270051 -2.58947874
H  2.9661924 3.88066154 -1.82218634
H  1.06275896 0.59974567 -5.04565688
H  3.18686646 4.27021381 -4.25889013
H  2.24038116 2.63382533 -5.88098504
C  1.21206307 3.32863842 0.37483768
C  0.31727927 4.12661934 -0.35455532
C  1.63103768 3.77442905 1.63635613
C  -0.13927002 5.3384293 0.16061647
C  1.17598342 4.98827922 2.15037907
C  0.2890602 5.77473222 1.41514164
H  -0.02631215 3.8012825 -1.34130989
H  2.32051397 3.16579549 2.22878063
H  -0.83309977 5.94776009 -0.42440232
H  1.51863758 5.3208785 3.13360206
H  -0.06723319 6.72597571 1.81805247
C  -3.97963088 -2.14896669 1.84444297
C  -2.79001703 -2.4572495 2.5079813
C  -1.62551347 -1.81357087 2.12238556
N  -1.58392457 -0.90592044 1.1254887
C  -2.74057307 -0.57514996 0.50401216
C  -3.94921417 -1.1912572 0.84013132
H  -4.91640583 -2.63964867 2.11764155
H  -2.75943695 -3.1860824 3.31984539
H  -0.67840773 -2.01287048 2.6274058
H  -4.85780348 -0.90095177 0.30769357
H  -3.38271146 1.28573373 -0.24720436
