program: TURBOMOLE
programVersion: 7.3
elementType: o
basis: def2-TZVP
elementType: v
elementType: c
elementType: h
elementType: nb
method: uhf
method: dft
functional: pbe0
elementType: o v c h nb
basis: def2-TZVP def2-TZVP def2-TZVP def2-TZVP def2-TZVP
correction: disp3
energy: -6685.240172106 hartree
formula: C12H38NbO19V5
InChI: InChI=1/12CH3O.Nb.H2O.6O.5V/c12*1-2;;;;;;;;;;;;;/h12*1H3;;1H2;;;;;;;;;;;/rC12H38NbO19V5/c1-21-13(14)20-37(19)29(9)33(21,15)25(5)34(16,22(13)2,30(37)10)27(7)36(18,24(13)4,32(37)12)28(8)35(17,23(13)3,26(33)6)31(37)11/h19H2,1-12H3
75 atoms
O  0.08843586 -3.91507616 -0.20754772
V  -0.68615443 0.2535521 -2.2880559
O  -1.15011655 0.33554957 -3.78590761
O  -1.90934555 -1.94645713 0.47194381
O  -0.505066 -1.76607561 -2.0410546
O  -2.43207144 0.12430485 -1.30869689
O  1.90918465 -1.83124618 -0.68152413
O  1.30561729 0.29458708 -2.43520964
O  -0.62701455 2.19432294 -1.7711469
O  -0.001032 0.09237837 0.0068232
C  -2.91546025 -2.91015845 0.73125801
H  -3.28177121 -2.7928306 1.75289981
H  -2.50483121 -3.91343626 0.59931226
H  -3.75131672 -2.76197331 0.04467338
C  0.04366498 -2.46999053 -3.14533196
H  -0.57333087 -2.2800098 -4.02558271
H  0.06294967 -3.54007001 -2.92449485
H  1.05977508 -2.11575087 -3.33872429
C  -3.41950155 -0.67095184 -1.92964234
H  -3.61023358 -0.29089179 -2.93717954
H  -4.34357199 -0.63269865 -1.34576357
H  -3.09108578 -1.71218063 -2.0150414
C  3.00364472 -2.72050433 -0.79532959
H  3.71017404 -2.5475626 0.02017529
H  3.51849421 -2.5411534 -1.74155761
H  2.64380496 -3.75132652 -0.7566697
C  1.82952238 1.20547232 -3.37753457
H  2.91131845 1.06723818 -3.45718774
H  1.62405496 2.23860602 -3.07774449
H  1.36432776 1.02861969 -4.35117889
C  -1.72988362 2.95559004 -2.19787784
H  -1.67557054 3.98339643 -1.81429648
H  -2.66456375 2.51427361 -1.84147578
H  -1.74645601 2.99189742 -3.2903164
V  -0.02350179 2.14192186 0.10820736
O  0.01961839 4.3158789 0.17189553
V  2.27318141 0.17636533 -0.68345563
O  3.77391531 0.19330623 -1.14660695
V  0.69416903 0.02101889 2.2782879
O  1.14106005 -0.04614428 3.78247501
O  1.85141227 2.12014786 -0.46651501
O  0.56022098 2.00488781 1.98016172
O  2.44989713 0.04747848 1.31119588
O  -1.87539876 2.01353361 0.66277184
O  -1.30948848 -0.03616118 2.43320654
O  0.61744555 -1.96252793 1.80788799
C  2.7922878 3.14973536 -0.42535243
H  3.78684951 2.76631931 -0.66520044
H  2.54844329 3.92910405 -1.16042264
H  2.84519468 3.60251318 0.57580167
C  -0.02731299 2.73956162 3.0281805
H  0.64440855 2.74041612 3.89088727
H  -0.21536531 3.77390391 2.71844023
H  -0.97922032 2.2911909 3.32528059
C  3.46830803 0.79448269 1.93869414
H  3.67356065 0.37081145 2.92601844
H  4.37777558 0.7635174 1.33212598
H  3.16498455 1.83781468 2.07596978
C  -2.7930212 2.96818813 1.12910136
H  -3.68675175 2.96889253 0.49814651
H  -3.09958278 2.73445542 2.15241475
H  -2.34409808 3.96555843 1.11312566
C  -1.81392919 -0.91032924 3.42018815
H  -2.90190185 -0.81169718 3.47711473
H  -1.56039929 -1.95114803 3.19244404
H  -1.37450736 -0.65691754 4.38902327
C  1.56936068 -2.7874475 2.45788693
H  1.47164162 -3.8152458 2.09994157
H  2.57882898 -2.42137034 2.25358971
H  1.39402815 -2.74835311 3.53492561
O  -3.7960683 0.05979028 1.13626345
V  -2.2921197 0.06357818 0.68883533
Nb -0.0024867 -2.21641463 -0.11762675
H  0.0047541 4.67911125 -0.72094701
H  0.82278938 4.65009057 0.58649817
empdispcorrection: -0.124319268 hartree
energy: -6685.2401721061487
energyOcCorr: -6685.2400831007
elementType: o v c h
s2: 12.06187534
charge: 0.000000
dipole: 1.729501 -1.378994 0.350507 136.626251 -133.471606 3.154646 15.727218 -15.547478 0.179740
quadrupole: 5113.193257 -5332.571775 -219.378518 5010.970222 -5186.948288 -175.978067 4915.398069 -5140.772830 -225.374761 15.771167 -10.425810 5.345357 -11.265219 11.006939 -0.258280 -10.294584 9.599954 -0.694630
